{"text_format":"1","workbook":"xlsx","n_sheets":27,"sheets":[" ","サマリー","ユーザー推移","曜日・時間別セッション数","地域別ユーザー数","ユーザー属性ごとのユーザー数","集客チャンネル","集客ペイドユーザー数推移","集客キーワード","集客参照サイト","コンテンツごとのデータ","_console","_集キーワード","_行ページ","_ユ","_ユ推移","_ユデバイス","_ユ国","_ユ市区","_ユ曜日","_ユ性別","_ユ年齢","_ユインタレスト","_集チャンネル","_集参照サイト","_集ペイド","Report Configuration"],"not_rendered":{"charts":7,"images":0,"macros":1,"external_links":0,"defined_names":196,"comments":0,"pivot_tables":1},"unopened":[],"bounds":{"document_bytes":16777216,"sheet_cells":100000,"rows_first":2000,"rows_last":500,"rows_between":2000,"halvings":0,"cell_chars":16384,"cell_head_chars":4096},"cells_cut":0,"cells_raw":0,"read":"whole","date_system":"1900"}

{"sheet":" ","index":0,"n_rows":26,"n_cols":40,"rows_kept":26,"cut":false,"hidden":false,"merged":[[25,0,25,43],[1,39,1,42],[14,16,14,21],[14,24,14,29],[14,22,14,23],[22,0,22,43],[7,0,7,44],[8,0,8,44],[10,0,10,44],[23,0,23,44]]}
[]
[null,"このレポートの元となる数値はダミーです。したがって、値の整合性があわない箇所も存在します。",null,null,null,null,null,null,null,null,null,null,null,null,null,null,null,null,null,null,null,null,null,null,null,null,null,null,null,null,null,null,null,null,null,null,null,null,null,"2019-07-31"]
[]
[]
[]
[]
[]
["officeants.comサイト"]
["アクセス解析"]
[]
["モニタリングレポート"]
[]
[]
[]
[null,null,null,null,null,null,null,null,null,null,null,null,null,null,null,null,{"$f":"'Report Configuration'!B4","v":"2019-07-01"},null,null,null,null,null,"～",null,{"$f":"'Report Configuration'!B5","v":"2019-07-31"}]
[]
[]
[]
[]
[]
[]
[]
[]
["集計担当：オフィスアンツ　加藤"]
[]
["ロゴを張り付け"]

{"sheet":"サマリー","index":1,"n_rows":29,"n_cols":31,"rows_kept":29,"cut":false,"hidden":false,"merged":[[1,30,1,38],[2,30,4,38],[7,30,7,38],[8,30,10,38],[1,17,1,25],[2,17,4,25],[7,17,7,25],[8,17,10,25],[7,4,7,12],[8,4,10,12],[2,4,4,12],[1,4,1,12],[13,4,13,12],[13,26,14,32],[27,4,29,12],[27,14,29,22],[26,4,26,22],[20,4,20,22],[21,4,23,22],[14,4,16,12]]}
[]
[null,null,null,null,"ユーザー数",null,null,null,null,null,null,null,null,null,null,null,null,"セッション数",null,null,null,null,null,null,null,null,null,null,null,null,"ページビュー数"]
[null,null,null,null,{"$f":"IF(_ユ!A12=\"\",\"\",_ユ!A12)","v":12247},null,null,null,null,null,null,null,null,null,null,null,null,{"$f":"IF(_ユ!B12=\"\",\"\",_ユ!B12)","v":15045},null,null,null,null,null,null,null,null,null,null,null,null,{"$f":"IF(_ユ!C12=\"\",\"\",_ユ!C12)","v":37404}]
[]
[]
[]
[]
[null,null,null,null,"直帰率",null,null,null,null,null,null,null,null,null,null,null,null,"平均セッション時間",null,null,null,null,null,null,null,null,null,null,null,null,"リピート率"]
[null,null,null,null,{"$f":"IF(_ユ!D12=\"\",\"\",_ユ!D12)","v":0.66161515453639086},null,null,null,null,null,null,null,null,null,null,null,null,{"$f":"IF(_ユ!E12=\"\",\"\",_ユ!E12)","v":82.221535393818499},null,null,null,null,null,null,null,null,null,null,null,null,{"$f":"IF(_ユ!F12=\"\",\"\",_ユ!F12)","v":1.2284641136604799}]
[]
[]
[]
[]
[null,null,null,null,"ページ数/セッション数",null,null,null,null,null,null,null,null,null,null,null,null,null,null,null,null,null,null,null,null,null,"デバイス"]
[null,null,null,null,{"$f":"IF(_ユ!G12=\"\",\"\",_ユ!G12)","v":2.48614157527417}]
[]
[]
[]
[]
[]
[null,null,null,null,"ソース"]
[null,null,null,null,"Googleアナリティクス,Googleサーチコンソール"]
[]
[]
[]
[]
[null,null,null,null,"計測期間"]
[null,null,null,null,{"$f":"'Report Configuration'!B4","v":"2019-07-01"},null,null,null,null,null,null,null,null,null,{"$f":"'Report Configuration'!B5","v":"2019-07-31"}]
[null,null,null,null,null,null,null,null,null,null,null,null,null,"～"]

{"sheet":"ユーザー推移","index":2,"n_rows":30,"n_cols":24,"rows_kept":30,"cut":false,"hidden":false,"merged":[[29,14,29,17],[29,18,29,19],[29,20,29,22],[29,23,29,26],[27,14,27,17],[27,18,27,19],[27,20,27,22],[27,23,27,26],[28,14,28,17],[28,18,28,19],[28,20,28,22],[28,23,28,26],[25,14,25,17],[25,18,25,19],[25,20,25,22],[25,23,25,26],[26,14,26,17],[26,18,26,19],[26,20,26,22],[26,23,26,26],[23,14,23,17],[23,18,23,19],[23,20,23,22],[23,23,23,26],[24,14,24,17],[24,18,24,19],[24,20,24,22],[24,23,24,26],[21,14,21,17],[21,18,21,19],[21,20,21,22],[21,23,21,26],[22,14,22,17],[22,18,22,19],[22,20,22,22],[22,23,22,26],[19,14,19,17],[19,18,19,19],[19,20,19,22],[19,23,19,26],[20,14,20,17],[20,18,20,19],[20,20,20,22],[20,23,20,26],[17,14,17,17],[17,18,17,19],[17,20,17,22],[17,23,17,26],[18,14,18,17],[18,18,18,19],[18,20,18,22],[18,23,18,26],[15,14,15,17],[15,18,15,19],[15,20,15,22],[15,23,15,26],[16,14,16,17],[16,18,16,19],[16,20,16,22],[16,23,16,26],[13,20,13,22],[13,23,13,26],[14,14,14,17],[14,18,14,19],[14,20,14,22],[14,23,14,26],[10,20,10,22],[10,23,10,26],[11,18,11,19],[11,20,11,22],[11,23,11,26],[12,18,12,19],[12,20,12,22],[12,23,12,26],[13,14,13,17],[13,18,13,19],[11,14,11,17],[12,14,12,17],[10,14,10,17],[10,18,10,19],[28,9,28,12],[29,9,29,12],[25,6,25,8],[26,6,26,8],[27,6,27,8],[28,6,28,8],[29,6,29,8],[22,9,22,12],[23,9,23,12],[24,9,24,12],[25,9,25,12],[26,9,26,12],[27,9,27,12],[17,9,17,12],[18,9,18,12],[19,9,19,12],[20,9,20,12],[21,9,21,12],[22,6,22,8],[23,6,23,8],[24,6,24,8],[17,6,17,8],[18,6,18,8],[19,6,19,8],[20,6,20,8],[10,9,10,12],[11,9,11,12],[12,9,12,12],[13,9,13,12],[14,9,14,12],[15,9,15,12],[15,6,15,8],[16,6,16,8],[16,9,16,12],[10,0,10,3],[10,4,10,5],[11,6,11,8],[12,6,12,8],[13,6,13,8],[14,6,14,8],[21,6,21,8],[26,4,26,5],[27,4,27,5],[20,0,20,3],[17,0,17,3],[18,0,18,3],[16,0,16,3],[10,6,10,8],[28,4,28,5],[29,4,29,5],[30,4,30,5],[20,4,20,5],[21,4,21,5],[22,4,22,5],[23,4,23,5],[24,4,24,5],[25,4,25,5],[29,0,29,3],[11,4,11,5],[12,4,12,5],[13,4,13,5],[14,4,14,5],[15,4,15,5],[16,4,16,5],[17,4,17,5],[18,4,18,5],[19,4,19,5],[11,0,11,3],[12,0,12,3],[13,0,13,3],[14,0,14,3],[15,0,15,3],[27,0,27,3],[28,0,28,3],[25,0,25,3],[26,0,26,3],[23,0,23,3],[24,0,24,3],[21,0,21,3],[22,0,22,3],[19,0,19,3]]}
[]
[]
[]
[]
[]
[]
[]
[]
[]
[]
[{"$f":"IF(_ユ推移!A15=\"\",\"\",_ユ推移!A15)","v":"Date"},null,null,null,{"$f":"IF(_ユ推移!B15=\"\",\"\",_ユ推移!B15)","v":"Users"},null,{"$f":"IF(_ユ推移!C15=\"\",\"\",_ユ推移!C15)","v":"Sessions"},null,null,{"$f":"IF(_ユ推移!D15=\"\",\"\",_ユ推移!D15)","v":"Pageviews"},null,null,null,null,{"$f":"IF(_ユ推移!A15=\"\",\"\",_ユ推移!A15)","v":"Date"},null,null,null,{"$f":"IF(_ユ推移!B15=\"\",\"\",_ユ推移!B15)","v":"Users"},null,{"$f":"IF(_ユ推移!C15=\"\",\"\",_ユ推移!C15)","v":"Sessions"},null,null,{"$f":"IF(_ユ推移!D15=\"\",\"\",_ユ推移!D15)","v":"Pageviews"}]
[{"$f":"IF(_ユ推移!A16=\"\",\"\",_ユ推移!A16)","v":"2019-07-01"},null,null,null,{"$f":"IF(_ユ推移!B16=\"\",\"\",_ユ推移!B16)","v":5160},null,{"$f":"IF(_ユ推移!C16=\"\",\"\",_ユ推移!C16)","v":6417},null,null,{"$f":"IF(_ユ推移!D16=\"\",\"\",_ユ推移!D16)","v":20179},null,null,null,null,{"$f":"IF(_ユ推移!A35=\"\",\"\",_ユ推移!A35)","v":"2019-07-20"},null,null,null,{"$f":"IF(_ユ推移!B35=\"\",\"\",_ユ推移!B35)","v":2424},null,{"$f":"IF(_ユ推移!C35=\"\",\"\",_ユ推移!C35)","v":7386},null,null,{"$f":"IF(_ユ推移!D35=\"\",\"\",_ユ推移!D35)","v":22179}]
[{"$f":"IF(_ユ推移!A17=\"\",\"\",_ユ推移!A17)","v":"2019-07-02"},null,null,null,{"$f":"IF(_ユ推移!B17=\"\",\"\",_ユ推移!B17)","v":4856},null,{"$f":"IF(_ユ推移!C17=\"\",\"\",_ユ推移!C17)","v":6468},null,null,{"$f":"IF(_ユ推移!D17=\"\",\"\",_ユ推移!D17)","v":21179},null,null,null,null,{"$f":"IF(_ユ推移!A36=\"\",\"\",_ユ推移!A36)","v":"2019-07-21"},null,null,null,{"$f":"IF(_ユ推移!B36=\"\",\"\",_ユ推移!B36)","v":2120},null,{"$f":"IF(_ユ推移!C36=\"\",\"\",_ユ推移!C36)","v":3321},null,null,{"$f":"IF(_ユ推移!D36=\"\",\"\",_ユ推移!D36)","v":23179}]
[{"$f":"IF(_ユ推移!A18=\"\",\"\",_ユ推移!A18)","v":"2019-07-03"},null,null,null,{"$f":"IF(_ユ推移!B18=\"\",\"\",_ユ推移!B18)","v":4552},null,{"$f":"IF(_ユ推移!C18=\"\",\"\",_ユ推移!C18)","v":6519},null,null,{"$f":"IF(_ユ推移!D18=\"\",\"\",_ユ推移!D18)","v":22179},null,null,null,null,{"$f":"IF(_ユ推移!A37=\"\",\"\",_ユ推移!A37)","v":"2019-07-22"},null,null,null,{"$f":"IF(_ユ推移!B37=\"\",\"\",_ユ推移!B37)","v":1816},null,{"$f":"IF(_ユ推移!C37=\"\",\"\",_ユ推移!C37)","v":3321},null,null,{"$f":"IF(_ユ推移!D37=\"\",\"\",_ユ推移!D37)","v":24179}]
[{"$f":"IF(_ユ推移!A19=\"\",\"\",_ユ推移!A19)","v":"2019-07-04"},null,null,null,{"$f":"IF(_ユ推移!B19=\"\",\"\",_ユ推移!B19)","v":4248},null,{"$f":"IF(_ユ推移!C19=\"\",\"\",_ユ推移!C19)","v":6570},null,null,{"$f":"IF(_ユ推移!D19=\"\",\"\",_ユ推移!D19)","v":23179},null,null,null,null,{"$f":"IF(_ユ推移!A38=\"\",\"\",_ユ推移!A38)","v":"2019-07-23"},null,null,null,{"$f":"IF(_ユ推移!B38=\"\",\"\",_ユ推移!B38)","v":1512},null,{"$f":"IF(_ユ推移!C38=\"\",\"\",_ユ推移!C38)","v":3321},null,null,{"$f":"IF(_ユ推移!D38=\"\",\"\",_ユ推移!D38)","v":25179}]
[{"$f":"IF(_ユ推移!A20=\"\",\"\",_ユ推移!A20)","v":"2019-07-05"},null,null,null,{"$f":"IF(_ユ推移!B20=\"\",\"\",_ユ推移!B20)","v":3944},null,{"$f":"IF(_ユ推移!C20=\"\",\"\",_ユ推移!C20)","v":6621},null,null,{"$f":"IF(_ユ推移!D20=\"\",\"\",_ユ推移!D20)","v":24179},null,null,null,null,{"$f":"IF(_ユ推移!A39=\"\",\"\",_ユ推移!A39)","v":"2019-07-24"},null,null,null,{"$f":"IF(_ユ推移!B39=\"\",\"\",_ユ推移!B39)","v":3336},null,{"$f":"IF(_ユ推移!C39=\"\",\"\",_ユ推移!C39)","v":3321},null,null,{"$f":"IF(_ユ推移!D39=\"\",\"\",_ユ推移!D39)","v":26179}]
[{"$f":"IF(_ユ推移!A21=\"\",\"\",_ユ推移!A21)","v":"2019-07-06"},null,null,null,{"$f":"IF(_ユ推移!B21=\"\",\"\",_ユ推移!B21)","v":3640},null,{"$f":"IF(_ユ推移!C21=\"\",\"\",_ユ推移!C21)","v":6672},null,null,{"$f":"IF(_ユ推移!D21=\"\",\"\",_ユ推移!D21)","v":25179},null,null,null,null,{"$f":"IF(_ユ推移!A40=\"\",\"\",_ユ推移!A40)","v":"2019-07-25"},null,null,null,{"$f":"IF(_ユ推移!B40=\"\",\"\",_ユ推移!B40)","v":3032},null,{"$f":"IF(_ユ推移!C40=\"\",\"\",_ユ推移!C40)","v":3321},null,null,{"$f":"IF(_ユ推移!D40=\"\",\"\",_ユ推移!D40)","v":27179}]
[{"$f":"IF(_ユ推移!A22=\"\",\"\",_ユ推移!A22)","v":"2019-07-07"},null,null,null,{"$f":"IF(_ユ推移!B22=\"\",\"\",_ユ推移!B22)","v":3336},null,{"$f":"IF(_ユ推移!C22=\"\",\"\",_ユ推移!C22)","v":6723},null,null,{"$f":"IF(_ユ推移!D22=\"\",\"\",_ユ推移!D22)","v":26179},null,null,null,null,{"$f":"IF(_ユ推移!A41=\"\",\"\",_ユ推移!A41)","v":"2019-07-26"},null,null,null,{"$f":"IF(_ユ推移!B41=\"\",\"\",_ユ推移!B41)","v":2728},null,{"$f":"IF(_ユ推移!C41=\"\",\"\",_ユ推移!C41)","v":3321},null,null,{"$f":"IF(_ユ推移!D41=\"\",\"\",_ユ推移!D41)","v":28179}]
[{"$f":"IF(_ユ推移!A23=\"\",\"\",_ユ推移!A23)","v":"2019-07-08"},null,null,null,{"$f":"IF(_ユ推移!B23=\"\",\"\",_ユ推移!B23)","v":3032},null,{"$f":"IF(_ユ推移!C23=\"\",\"\",_ユ推移!C23)","v":6774},null,null,{"$f":"IF(_ユ推移!D23=\"\",\"\",_ユ推移!D23)","v":27179},null,null,null,null,{"$f":"IF(_ユ推移!A42=\"\",\"\",_ユ推移!A42)","v":"2019-07-27"},null,null,null,{"$f":"IF(_ユ推移!B42=\"\",\"\",_ユ推移!B42)","v":2424},null,{"$f":"IF(_ユ推移!C42=\"\",\"\",_ユ推移!C42)","v":3321},null,null,{"$f":"IF(_ユ推移!D42=\"\",\"\",_ユ推移!D42)","v":29179}]
[{"$f":"IF(_ユ推移!A24=\"\",\"\",_ユ推移!A24)","v":"2019-07-09"},null,null,null,{"$f":"IF(_ユ推移!B24=\"\",\"\",_ユ推移!B24)","v":2728},null,{"$f":"IF(_ユ推移!C24=\"\",\"\",_ユ推移!C24)","v":6825},null,null,{"$f":"IF(_ユ推移!D24=\"\",\"\",_ユ推移!D24)","v":28179},null,null,null,null,{"$f":"IF(_ユ推移!A43=\"\",\"\",_ユ推移!A43)","v":"2019-07-28"},null,null,null,{"$f":"IF(_ユ推移!B43=\"\",\"\",_ユ推移!B43)","v":2120},null,{"$f":"IF(_ユ推移!C43=\"\",\"\",_ユ推移!C43)","v":3321},null,null,{"$f":"IF(_ユ推移!D43=\"\",\"\",_ユ推移!D43)","v":30179}]
[{"$f":"IF(_ユ推移!A25=\"\",\"\",_ユ推移!A25)","v":"2019-07-10"},null,null,null,{"$f":"IF(_ユ推移!B25=\"\",\"\",_ユ推移!B25)","v":2424},null,{"$f":"IF(_ユ推移!C25=\"\",\"\",_ユ推移!C25)","v":6876},null,null,{"$f":"IF(_ユ推移!D25=\"\",\"\",_ユ推移!D25)","v":29179},null,null,null,null,{"$f":"IF(_ユ推移!A44=\"\",\"\",_ユ推移!A44)","v":"2019-07-29"},null,null,null,{"$f":"IF(_ユ推移!B44=\"\",\"\",_ユ推移!B44)","v":1816},null,{"$f":"IF(_ユ推移!C44=\"\",\"\",_ユ推移!C44)","v":3321},null,null,{"$f":"IF(_ユ推移!D44=\"\",\"\",_ユ推移!D44)","v":31179}]
[{"$f":"IF(_ユ推移!A26=\"\",\"\",_ユ推移!A26)","v":"2019-07-11"},null,null,null,{"$f":"IF(_ユ推移!B26=\"\",\"\",_ユ推移!B26)","v":2120},null,{"$f":"IF(_ユ推移!C26=\"\",\"\",_ユ推移!C26)","v":6927},null,null,{"$f":"IF(_ユ推移!D26=\"\",\"\",_ユ推移!D26)","v":30179},null,null,null,null,{"$f":"IF(_ユ推移!A45=\"\",\"\",_ユ推移!A45)","v":"2019-07-30"},null,null,null,{"$f":"IF(_ユ推移!B45=\"\",\"\",_ユ推移!B45)","v":1512},null,{"$f":"IF(_ユ推移!C45=\"\",\"\",_ユ推移!C45)","v":3321},null,null,{"$f":"IF(_ユ推移!D45=\"\",\"\",_ユ推移!D45)","v":32179}]
[{"$f":"IF(_ユ推移!A27=\"\",\"\",_ユ推移!A27)","v":"2019-07-12"},null,null,null,{"$f":"IF(_ユ推移!B27=\"\",\"\",_ユ推移!B27)","v":1816},null,{"$f":"IF(_ユ推移!C27=\"\",\"\",_ユ推移!C27)","v":6978},null,null,{"$f":"IF(_ユ推移!D27=\"\",\"\",_ユ推移!D27)","v":31179},null,null,null,null,{"$f":"IF(_ユ推移!A46=\"\",\"\",_ユ推移!A46)","v":"2019-07-31"},null,null,null,{"$f":"IF(_ユ推移!B46=\"\",\"\",_ユ推移!B46)","v":1208},null,{"$f":"IF(_ユ推移!C46=\"\",\"\",_ユ推移!C46)","v":3321},null,null,{"$f":"IF(_ユ推移!D46=\"\",\"\",_ユ推移!D46)","v":33179}]
[{"$f":"IF(_ユ推移!A28=\"\",\"\",_ユ推移!A28)","v":"2019-07-13"},null,null,null,{"$f":"IF(_ユ推移!B28=\"\",\"\",_ユ推移!B28)","v":1512},null,{"$f":"IF(_ユ推移!C28=\"\",\"\",_ユ推移!C28)","v":7029},null,null,{"$f":"IF(_ユ推移!D28=\"\",\"\",_ユ推移!D28)","v":32179},null,null,null,null,{"$f":"IF(_ユ推移!A47=\"\",\"\",_ユ推移!A47)","v":""},null,null,null,{"$f":"IF(_ユ推移!B47=\"\",\"\",_ユ推移!B47)","v":""},null,{"$f":"IF(_ユ推移!C47=\"\",\"\",_ユ推移!C47)","v":""},null,null,{"$f":"IF(_ユ推移!D47=\"\",\"\",_ユ推移!D47)","v":""}]
[{"$f":"IF(_ユ推移!A29=\"\",\"\",_ユ推移!A29)","v":"2019-07-14"},null,null,null,{"$f":"IF(_ユ推移!B29=\"\",\"\",_ユ推移!B29)","v":1208},null,{"$f":"IF(_ユ推移!C29=\"\",\"\",_ユ推移!C29)","v":7080},null,null,{"$f":"IF(_ユ推移!D29=\"\",\"\",_ユ推移!D29)","v":33179},null,null,null,null,{"$f":"IF(_ユ推移!A48=\"\",\"\",_ユ推移!A48)","v":""},null,null,null,{"$f":"IF(_ユ推移!B48=\"\",\"\",_ユ推移!B48)","v":""},null,{"$f":"IF(_ユ推移!C48=\"\",\"\",_ユ推移!C48)","v":""},null,null,{"$f":"IF(_ユ推移!D48=\"\",\"\",_ユ推移!D48)","v":""}]
[{"$f":"IF(_ユ推移!A30=\"\",\"\",_ユ推移!A30)","v":"2019-07-15"},null,null,null,{"$f":"IF(_ユ推移!B30=\"\",\"\",_ユ推移!B30)","v":904},null,{"$f":"IF(_ユ推移!C30=\"\",\"\",_ユ推移!C30)","v":7131},null,null,{"$f":"IF(_ユ推移!D30=\"\",\"\",_ユ推移!D30)","v":34179},null,null,null,null,{"$f":"IF(_ユ推移!A49=\"\",\"\",_ユ推移!A49)","v":""},null,null,null,{"$f":"IF(_ユ推移!B49=\"\",\"\",_ユ推移!B49)","v":""},null,{"$f":"IF(_ユ推移!C49=\"\",\"\",_ユ推移!C49)","v":""},null,null,{"$f":"IF(_ユ推移!D49=\"\",\"\",_ユ推移!D49)","v":""}]
[{"$f":"IF(_ユ推移!A31=\"\",\"\",_ユ推移!A31)","v":"2019-07-16"},null,null,null,{"$f":"IF(_ユ推移!B31=\"\",\"\",_ユ推移!B31)","v":600},null,{"$f":"IF(_ユ推移!C31=\"\",\"\",_ユ推移!C31)","v":7182},null,null,{"$f":"IF(_ユ推移!D31=\"\",\"\",_ユ推移!D31)","v":35179},null,null,null,null,{"$f":"IF(_ユ推移!A50=\"\",\"\",_ユ推移!A50)","v":""},null,null,null,{"$f":"IF(_ユ推移!B50=\"\",\"\",_ユ推移!B50)","v":""},null,{"$f":"IF(_ユ推移!C50=\"\",\"\",_ユ推移!C50)","v":""},null,null,{"$f":"IF(_ユ推移!D50=\"\",\"\",_ユ推移!D50)","v":""}]
[{"$f":"IF(_ユ推移!A32=\"\",\"\",_ユ推移!A32)","v":"2019-07-17"},null,null,null,{"$f":"IF(_ユ推移!B32=\"\",\"\",_ユ推移!B32)","v":3336},null,{"$f":"IF(_ユ推移!C32=\"\",\"\",_ユ推移!C32)","v":7233},null,null,{"$f":"IF(_ユ推移!D32=\"\",\"\",_ユ推移!D32)","v":36179},null,null,null,null,{"$f":"IF(_ユ推移!A51=\"\",\"\",_ユ推移!A51)","v":""},null,null,null,{"$f":"IF(_ユ推移!B51=\"\",\"\",_ユ推移!B51)","v":""},null,{"$f":"IF(_ユ推移!C51=\"\",\"\",_ユ推移!C51)","v":""},null,null,{"$f":"IF(_ユ推移!D51=\"\",\"\",_ユ推移!D51)","v":""}]
[{"$f":"IF(_ユ推移!A33=\"\",\"\",_ユ推移!A33)","v":"2019-07-18"},null,null,null,{"$f":"IF(_ユ推移!B33=\"\",\"\",_ユ推移!B33)","v":3032},null,{"$f":"IF(_ユ推移!C33=\"\",\"\",_ユ推移!C33)","v":7284},null,null,{"$f":"IF(_ユ推移!D33=\"\",\"\",_ユ推移!D33)","v":22179},null,null,null,null,{"$f":"IF(_ユ推移!A52=\"\",\"\",_ユ推移!A52)","v":""},null,null,null,{"$f":"IF(_ユ推移!B52=\"\",\"\",_ユ推移!B52)","v":""},null,{"$f":"IF(_ユ推移!C52=\"\",\"\",_ユ推移!C52)","v":""},null,null,{"$f":"IF(_ユ推移!D52=\"\",\"\",_ユ推移!D52)","v":""}]
[{"$f":"IF(_ユ推移!A34=\"\",\"\",_ユ推移!A34)","v":"2019-07-19"},null,null,null,{"$f":"IF(_ユ推移!B34=\"\",\"\",_ユ推移!B34)","v":2728},null,{"$f":"IF(_ユ推移!C34=\"\",\"\",_ユ推移!C34)","v":7335},null,null,{"$f":"IF(_ユ推移!D34=\"\",\"\",_ユ推移!D34)","v":22179},null,null,null,null,{"$f":"IF(_ユ推移!A53=\"\",\"\",_ユ推移!A53)","v":""},null,null,null,{"$f":"IF(_ユ推移!B53=\"\",\"\",_ユ推移!B53)","v":""},null,{"$f":"IF(_ユ推移!C53=\"\",\"\",_ユ推移!C53)","v":""},null,null,{"$f":"IF(_ユ推移!D53=\"\",\"\",_ユ推移!D53)","v":""}]

{"sheet":"曜日・時間別セッション数","index":3,"n_rows":28,"n_cols":10,"rows_kept":28,"cut":false,"hidden":false,"merged":[]}
[null,null,"合計 / Sessions","曜日"]
[null,null,"時","日","水","木","金","土","(空白)","総計"]
[null,null,0,72,0,252,75,110,null,509]
[null,null,1,49,0,192,57,69,null,367]
[null,null,2,47,0,125,53,62,null,287]
[null,null,3,41,0,98,34,41,null,214]
[null,null,4,41,1,86,28,47,null,203]
[null,null,5,41,0,83,54,43,null,221]
[null,null,6,38,0,127,60,45,null,270]
[null,null,7,62,0,164,66,63,null,355]
[null,null,8,45,15,158,60,77,null,355]
[null,null,9,63,168,103,59,88,null,481]
[null,null,10,79,834,158,58,89,null,1218]
[null,null,11,80,716,95,77,92,null,1060]
[null,null,12,94,1172,123,79,80,null,1548]
[null,null,13,95,493,90,88,110,null,876]
[null,null,14,83,316,86,74,82,null,641]
[null,null,15,73,299,92,84,109,null,657]
[null,null,16,92,231,90,79,104,null,596]
[null,null,17,104,240,105,125,118,null,692]
[null,null,18,103,294,87,96,97,null,677]
[null,null,19,85,356,110,114,75,null,740]
[null,null,20,112,356,148,98,102,null,816]
[null,null,21,121,311,155,115,85,null,787]
[null,null,22,121,331,146,92,92,null,782]
[null,null,23,102,284,94,118,95,null,693]
[null,null,"(空白)"]
[null,null,"総計",1843,6417,2967,1843,1975,null,15045]

{"sheet":"地域別ユーザー数","index":4,"n_rows":31,"n_cols":33,"rows_kept":31,"cut":false,"hidden":false,"merged":[[9,30,9,33],[28,28,28,31],[28,32,28,33],[29,28,29,31],[29,32,29,33],[30,28,30,31],[30,32,30,33],[25,28,25,31],[25,32,25,33],[26,28,26,31],[26,32,26,33],[27,28,27,31],[27,32,27,33],[22,28,22,31],[22,32,22,33],[23,28,23,31],[23,32,23,33],[24,28,24,31],[24,32,24,33],[19,28,19,31],[19,32,19,33],[20,28,20,31],[20,32,20,33],[21,28,21,31],[21,32,21,33],[16,28,16,31],[16,32,16,33],[17,28,17,31],[17,32,17,33],[18,28,18,31],[18,32,18,33],[13,28,13,31],[13,32,13,33],[14,28,14,31],[14,32,14,33],[15,28,15,31],[15,32,15,33],[10,28,10,31],[10,32,10,33],[11,28,11,31],[11,32,11,33],[12,28,12,31],[12,32,12,33],[28,21,28,24],[28,25,28,26],[29,21,29,24],[29,25,29,26],[19,21,19,24],[19,25,19,26],[20,21,20,24],[20,25,20,26],[21,21,21,24],[21,25,21,26],[16,21,16,24],[16,25,16,26],[17,21,17,24],[17,25,17,26],[18,21,18,24],[18,25,18,26],[13,21,13,24],[13,25,13,26],[30,21,30,24],[30,25,30,26],[25,21,25,24],[25,25,25,26],[26,21,26,24],[26,25,26,26],[27,21,27,24],[27,25,27,26],[22,21,22,24],[22,25,22,26],[23,21,23,24],[23,25,23,26],[24,21,24,24],[24,25,24,26],[14,21,14,24],[14,25,14,26],[15,21,15,24],[15,25,15,26],[10,21,10,24],[10,25,10,26],[11,21,11,24],[11,25,11,26],[12,21,12,24],[12,25,12,26],[28,14,28,17],[28,18,28,19],[29,14,29,17],[29,18,29,19],[30,14,30,17],[30,18,30,19],[25,14,25,17],[25,18,25,19],[26,14,26,17],[26,18,26,19],[27,14,27,17],[27,18,27,19],[22,14,22,17],[22,18,22,19],[23,14,23,17],[23,18,23,19],[24,14,24,17],[24,18,24,19],[19,14,19,17],[19,18,19,19],[20,14,20,17],[20,18,20,19],[21,14,21,17],[21,18,21,19],[16,14,16,17],[16,18,16,19],[17,14,17,17],[17,18,17,19],[18,14,18,17],[18,18,18,19],[13,14,13,17],[13,18,13,19],[14,14,14,17],[14,18,14,19],[15,14,15,17],[15,18,15,19],[10,14,10,17],[10,18,10,19],[11,14,11,17],[11,18,11,19],[12,14,12,17],[12,18,12,19],[28,7,28,10],[28,11,28,12],[29,7,29,10],[29,11,29,12],[19,7,19,10],[19,11,19,12],[20,7,20,10],[20,11,20,12],[21,7,21,10],[21,11,21,12],[16,7,16,10],[16,11,16,12],[17,7,17,10],[17,11,17,12],[18,7,18,10],[18,11,18,12],[13,7,13,10],[13,11,13,12],[30,7,30,10],[30,11,30,12],[25,7,25,10],[25,11,25,12],[26,7,26,10],[26,11,26,12],[27,7,27,10],[27,11,27,12],[22,7,22,10],[22,11,22,12],[23,7,23,10],[23,11,23,12],[24,7,24,10],[24,11,24,12],[14,7,14,10],[14,11,14,12],[15,7,15,10],[15,11,15,12],[28,4,28,5],[29,4,29,5],[30,0,30,3],[30,4,30,5],[10,7,10,10],[10,11,10,12],[11,7,11,10],[11,11,11,12],[12,7,12,10],[12,11,12,12],[28,0,28,3],[29,0,29,3],[10,4,10,5],[11,4,11,5],[12,4,12,5],[13,4,13,5],[14,4,14,5],[15,4,15,5],[25,0,25,3],[26,0,26,3],[27,0,27,3],[25,4,25,5],[26,4,26,5],[27,4,27,5],[22,0,22,3],[23,0,23,3],[24,0,24,3],[22,4,22,5],[23,4,23,5],[24,4,24,5],[19,4,19,5],[20,4,20,5],[21,4,21,5],[16,0,16,3],[17,0,17,3],[18,0,18,3],[16,4,16,5],[17,4,17,5],[18,4,18,5],[13,0,13,3],[14,0,14,3],[15,0,15,3],[10,0,10,3],[11,0,11,3],[12,0,12,3],[19,0,19,3],[20,0,20,3],[21,0,21,3]]}
["国別ユーザー数"]
[]
[]
[]
[]
[]
[]
[]
[]
["市区別ユーザー数",null,null,null,null,null,null,null,null,null,null,null,null,null,null,null,null,null,null,null,null,null,null,null,null,null,null,null,null,null,"単位：人"]
[{"$f":"IF(_ユ市区!A16=\"\",\"\",_ユ市区!A16)","v":"Shinjuku City"},null,null,null,{"$f":"IF(_ユ市区!B16=\"\",\"\",_ユ市区!B16)","v":1187},null,null,{"$f":"IF(_ユ市区!A37=\"\",\"\",_ユ市区!A37)","v":"Hamamatsu"},null,null,null,{"$f":"IF(_ユ市区!B37=\"\",\"\",_ユ市区!B37)","v":51},null,null,{"$f":"IF(_ユ市区!A58=\"\",\"\",_ユ市区!A58)","v":"Tsukuba"},null,null,null,{"$f":"IF(_ユ市区!B58=\"\",\"\",_ユ市区!B58)","v":30},null,null,{"$f":"IF(_ユ市区!A79=\"\",\"\",_ユ市区!A79)","v":"Chofu"},null,null,null,{"$f":"IF(_ユ市区!B79=\"\",\"\",_ユ市区!B79)","v":17},null,null,{"$f":"IF(_ユ市区!A100=\"\",\"\",_ユ市区!A100)","v":"Yamato"},null,null,null,{"$f":"IF(_ユ市区!B100=\"\",\"\",_ユ市区!B100)","v":12}]
[{"$f":"IF(_ユ市区!A17=\"\",\"\",_ユ市区!A17)","v":"Yokohama"},null,null,null,{"$f":"IF(_ユ市区!B17=\"\",\"\",_ユ市区!B17)","v":995},null,null,{"$f":"IF(_ユ市区!A38=\"\",\"\",_ユ市区!A38)","v":"(not set)"},null,null,null,{"$f":"IF(_ユ市区!B38=\"\",\"\",_ユ市区!B38)","v":50},null,null,{"$f":"IF(_ユ市区!A59=\"\",\"\",_ユ市区!A59)","v":"Toshima City"},null,null,null,{"$f":"IF(_ユ市区!B59=\"\",\"\",_ユ市区!B59)","v":28},null,null,{"$f":"IF(_ユ市区!A80=\"\",\"\",_ユ市区!A80)","v":"Kanazawa"},null,null,null,{"$f":"IF(_ユ市区!B80=\"\",\"\",_ユ市区!B80)","v":17},null,null,{"$f":"IF(_ユ市区!A101=\"\",\"\",_ユ市区!A101)","v":"Fuji"},null,null,null,{"$f":"IF(_ユ市区!B101=\"\",\"\",_ユ市区!B101)","v":11}]
[{"$f":"IF(_ユ市区!A18=\"\",\"\",_ユ市区!A18)","v":"Chiyoda City"},null,null,null,{"$f":"IF(_ユ市区!B18=\"\",\"\",_ユ市区!B18)","v":889},null,null,{"$f":"IF(_ユ市区!A39=\"\",\"\",_ユ市区!A39)","v":"Adachi City"},null,null,null,{"$f":"IF(_ユ市区!B39=\"\",\"\",_ユ市区!B39)","v":47},null,null,{"$f":"IF(_ユ市区!A60=\"\",\"\",_ユ市区!A60)","v":"Katsushika City"},null,null,null,{"$f":"IF(_ユ市区!B60=\"\",\"\",_ユ市区!B60)","v":27},null,null,{"$f":"IF(_ユ市区!A81=\"\",\"\",_ユ市区!A81)","v":"Morioka"},null,null,null,{"$f":"IF(_ユ市区!B81=\"\",\"\",_ユ市区!B81)","v":17},null,null,{"$f":"IF(_ユ市区!A102=\"\",\"\",_ユ市区!A102)","v":"Hakodate"},null,null,null,{"$f":"IF(_ユ市区!B102=\"\",\"\",_ユ市区!B102)","v":11}]
[{"$f":"IF(_ユ市区!A19=\"\",\"\",_ユ市区!A19)","v":"Osaka"},null,null,null,{"$f":"IF(_ユ市区!B19=\"\",\"\",_ユ市区!B19)","v":814},null,null,{"$f":"IF(_ユ市区!A40=\"\",\"\",_ユ市区!A40)","v":"Shinagawa City"},null,null,null,{"$f":"IF(_ユ市区!B40=\"\",\"\",_ユ市区!B40)","v":47},null,null,{"$f":"IF(_ユ市区!A61=\"\",\"\",_ユ市区!A61)","v":"Koshigaya"},null,null,null,{"$f":"IF(_ユ市区!B61=\"\",\"\",_ユ市区!B61)","v":27},null,null,{"$f":"IF(_ユ市区!A82=\"\",\"\",_ユ市区!A82)","v":"Chigasaki"},null,null,null,{"$f":"IF(_ユ市区!B82=\"\",\"\",_ユ市区!B82)","v":15},null,null,{"$f":"IF(_ユ市区!A103=\"\",\"\",_ユ市区!A103)","v":"Kumamoto"},null,null,null,{"$f":"IF(_ユ市区!B103=\"\",\"\",_ユ市区!B103)","v":11}]
[{"$f":"IF(_ユ市区!A20=\"\",\"\",_ユ市区!A20)","v":"Minato City"},null,null,null,{"$f":"IF(_ユ市区!B20=\"\",\"\",_ユ市区!B20)","v":754},null,null,{"$f":"IF(_ユ市区!A41=\"\",\"\",_ユ市区!A41)","v":"Shizuoka"},null,null,null,{"$f":"IF(_ユ市区!B41=\"\",\"\",_ユ市区!B41)","v":47},null,null,{"$f":"IF(_ユ市区!A62=\"\",\"\",_ユ市区!A62)","v":"Okayama"},null,null,null,{"$f":"IF(_ユ市区!B62=\"\",\"\",_ユ市区!B62)","v":27},null,null,{"$f":"IF(_ユ市区!A83=\"\",\"\",_ユ市区!A83)","v":"Ichihara"},null,null,null,{"$f":"IF(_ユ市区!B83=\"\",\"\",_ユ市区!B83)","v":15},null,null,{"$f":"IF(_ユ市区!A104=\"\",\"\",_ユ市区!A104)","v":"Narita"},null,null,null,{"$f":"IF(_ユ市区!B104=\"\",\"\",_ユ市区!B104)","v":11}]
[{"$f":"IF(_ユ市区!A21=\"\",\"\",_ユ市区!A21)","v":"Nagoya"},null,null,null,{"$f":"IF(_ユ市区!B21=\"\",\"\",_ユ市区!B21)","v":371},null,null,{"$f":"IF(_ユ市区!A42=\"\",\"\",_ユ市区!A42)","v":"Kawaguchi"},null,null,null,{"$f":"IF(_ユ市区!B42=\"\",\"\",_ユ市区!B42)","v":44},null,null,{"$f":"IF(_ユ市区!A63=\"\",\"\",_ユ市区!A63)","v":"Bunkyo City"},null,null,null,{"$f":"IF(_ユ市区!B63=\"\",\"\",_ユ市区!B63)","v":26},null,null,{"$f":"IF(_ユ市区!A84=\"\",\"\",_ユ市区!A84)","v":"Mitaka"},null,null,null,{"$f":"IF(_ユ市区!B84=\"\",\"\",_ユ市区!B84)","v":15},null,null,{"$f":"IF(_ユ市区!A105=\"\",\"\",_ユ市区!A105)","v":"Okazaki"},null,null,null,{"$f":"IF(_ユ市区!B105=\"\",\"\",_ユ市区!B105)","v":11}]
[{"$f":"IF(_ユ市区!A22=\"\",\"\",_ユ市区!A22)","v":"Saitama"},null,null,null,{"$f":"IF(_ユ市区!B22=\"\",\"\",_ユ市区!B22)","v":207},null,null,{"$f":"IF(_ユ市区!A43=\"\",\"\",_ユ市区!A43)","v":"Suginami City"},null,null,null,{"$f":"IF(_ユ市区!B43=\"\",\"\",_ユ市区!B43)","v":42},null,null,{"$f":"IF(_ユ市区!A64=\"\",\"\",_ユ市区!A64)","v":"Kawagoe"},null,null,null,{"$f":"IF(_ユ市区!B64=\"\",\"\",_ユ市区!B64)","v":25},null,null,{"$f":"IF(_ユ市区!A85=\"\",\"\",_ユ市区!A85)","v":"Noda"},null,null,null,{"$f":"IF(_ユ市区!B85=\"\",\"\",_ユ市区!B85)","v":15},null,null,{"$f":"IF(_ユ市区!A106=\"\",\"\",_ユ市区!A106)","v":"Ota"},null,null,null,{"$f":"IF(_ユ市区!B106=\"\",\"\",_ユ市区!B106)","v":11}]
[{"$f":"IF(_ユ市区!A23=\"\",\"\",_ユ市区!A23)","v":"Shibuya City"},null,null,null,{"$f":"IF(_ユ市区!B23=\"\",\"\",_ユ市区!B23)","v":178},null,null,{"$f":"IF(_ユ市区!A44=\"\",\"\",_ユ市区!A44)","v":"Funabashi"},null,null,null,{"$f":"IF(_ユ市区!B44=\"\",\"\",_ユ市区!B44)","v":41},null,null,{"$f":"IF(_ユ市区!A65=\"\",\"\",_ユ市区!A65)","v":"Nishitokyo"},null,null,null,{"$f":"IF(_ユ市区!B65=\"\",\"\",_ユ市区!B65)","v":25},null,null,{"$f":"IF(_ユ市区!A86=\"\",\"\",_ユ市区!A86)","v":"Asaka"},null,null,null,{"$f":"IF(_ユ市区!B86=\"\",\"\",_ユ市区!B86)","v":14},null,null,{"$f":"IF(_ユ市区!A107=\"\",\"\",_ユ市区!A107)","v":"Takamatsu"},null,null,null,{"$f":"IF(_ユ市区!B107=\"\",\"\",_ユ市区!B107)","v":11}]
[{"$f":"IF(_ユ市区!A24=\"\",\"\",_ユ市区!A24)","v":"Setagaya City"},null,null,null,{"$f":"IF(_ユ市区!B24=\"\",\"\",_ユ市区!B24)","v":169},null,null,{"$f":"IF(_ユ市区!A45=\"\",\"\",_ユ市区!A45)","v":"Edogawa City"},null,null,null,{"$f":"IF(_ユ市区!B45=\"\",\"\",_ユ市区!B45)","v":39},null,null,{"$f":"IF(_ユ市区!A66=\"\",\"\",_ユ市区!A66)","v":"Takasaki"},null,null,null,{"$f":"IF(_ユ市区!B66=\"\",\"\",_ユ市区!B66)","v":24},null,null,{"$f":"IF(_ユ市区!A87=\"\",\"\",_ユ市区!A87)","v":"Ichinomiya"},null,null,null,{"$f":"IF(_ユ市区!B87=\"\",\"\",_ユ市区!B87)","v":14},null,null,{"$f":"IF(_ユ市区!A108=\"\",\"\",_ユ市区!A108)","v":"Tokushima"},null,null,null,{"$f":"IF(_ユ市区!B108=\"\",\"\",_ユ市区!B108)","v":11}]
[{"$f":"IF(_ユ市区!A25=\"\",\"\",_ユ市区!A25)","v":"Sapporo"},null,null,null,{"$f":"IF(_ユ市区!B25=\"\",\"\",_ユ市区!B25)","v":134},null,null,{"$f":"IF(_ユ市区!A46=\"\",\"\",_ユ市区!A46)","v":"Sendai"},null,null,null,{"$f":"IF(_ユ市区!B46=\"\",\"\",_ユ市区!B46)","v":39},null,null,{"$f":"IF(_ユ市区!A67=\"\",\"\",_ユ市区!A67)","v":"Hiroshima"},null,null,null,{"$f":"IF(_ユ市区!B67=\"\",\"\",_ユ市区!B67)","v":23},null,null,{"$f":"IF(_ユ市区!A88=\"\",\"\",_ユ市区!A88)","v":"Tachikawa"},null,null,null,{"$f":"IF(_ユ市区!B88=\"\",\"\",_ユ市区!B88)","v":14},null,null,{"$f":"IF(_ユ市区!A109=\"\",\"\",_ユ市区!A109)","v":"Tsuchiura"},null,null,null,{"$f":"IF(_ユ市区!B109=\"\",\"\",_ユ市区!B109)","v":11}]
[{"$f":"IF(_ユ市区!A26=\"\",\"\",_ユ市区!A26)","v":"Fukuoka"},null,null,null,{"$f":"IF(_ユ市区!B26=\"\",\"\",_ユ市区!B26)","v":110},null,null,{"$f":"IF(_ユ市区!A47=\"\",\"\",_ユ市区!A47)","v":"Hachioji"},null,null,null,{"$f":"IF(_ユ市区!B47=\"\",\"\",_ユ市区!B47)","v":37},null,null,{"$f":"IF(_ユ市区!A68=\"\",\"\",_ユ市区!A68)","v":"Kitakyushu"},null,null,null,{"$f":"IF(_ユ市区!B68=\"\",\"\",_ユ市区!B68)","v":23},null,null,{"$f":"IF(_ユ市区!A89=\"\",\"\",_ユ市区!A89)","v":"Tama"},null,null,null,{"$f":"IF(_ユ市区!B89=\"\",\"\",_ユ市区!B89)","v":14},null,null,{"$f":"IF(_ユ市区!A110=\"\",\"\",_ユ市区!A110)","v":"Yokkaichi"},null,null,null,{"$f":"IF(_ユ市区!B110=\"\",\"\",_ユ市区!B110)","v":11}]
[{"$f":"IF(_ユ市区!A27=\"\",\"\",_ユ市区!A27)","v":"Kawasaki"},null,null,null,{"$f":"IF(_ユ市区!B27=\"\",\"\",_ユ市区!B27)","v":104},null,null,{"$f":"IF(_ユ市区!A48=\"\",\"\",_ユ市区!A48)","v":"Tokorozawa"},null,null,null,{"$f":"IF(_ユ市区!B48=\"\",\"\",_ユ市区!B48)","v":37},null,null,{"$f":"IF(_ユ市区!A69=\"\",\"\",_ユ市区!A69)","v":"Toyama"},null,null,null,{"$f":"IF(_ユ市区!B69=\"\",\"\",_ユ市区!B69)","v":23},null,null,{"$f":"IF(_ユ市区!A90=\"\",\"\",_ユ市区!A90)","v":"Hadano"},null,null,null,{"$f":"IF(_ユ市区!B90=\"\",\"\",_ユ市区!B90)","v":13},null,null,{"$f":"IF(_ユ市区!A111=\"\",\"\",_ユ市区!A111)","v":"Arakawa City"},null,null,null,{"$f":"IF(_ユ市区!B111=\"\",\"\",_ユ市区!B111)","v":10}]
[{"$f":"IF(_ユ市区!A28=\"\",\"\",_ユ市区!A28)","v":"Ota City"},null,null,null,{"$f":"IF(_ユ市区!B28=\"\",\"\",_ユ市区!B28)","v":75},null,null,{"$f":"IF(_ユ市区!A49=\"\",\"\",_ユ市区!A49)","v":"Niigata"},null,null,null,{"$f":"IF(_ユ市区!B49=\"\",\"\",_ユ市区!B49)","v":36},null,null,{"$f":"IF(_ユ市区!A70=\"\",\"\",_ユ市区!A70)","v":"Mito"},null,null,null,{"$f":"IF(_ユ市区!B70=\"\",\"\",_ユ市区!B70)","v":21},null,null,{"$f":"IF(_ユ市区!A91=\"\",\"\",_ユ市区!A91)","v":"Kodaira"},null,null,null,{"$f":"IF(_ユ市区!B91=\"\",\"\",_ユ市区!B91)","v":13},null,null,{"$f":"IF(_ユ市区!A112=\"\",\"\",_ユ市区!A112)","v":"Higashimurayama"},null,null,null,{"$f":"IF(_ユ市区!B112=\"\",\"\",_ユ市区!B112)","v":10}]
[{"$f":"IF(_ユ市区!A29=\"\",\"\",_ユ市区!A29)","v":"Chiba"},null,null,null,{"$f":"IF(_ユ市区!B29=\"\",\"\",_ユ市区!B29)","v":74},null,null,{"$f":"IF(_ユ市区!A50=\"\",\"\",_ユ市区!A50)","v":"Kita City"},null,null,null,{"$f":"IF(_ユ市区!B50=\"\",\"\",_ユ市区!B50)","v":34},null,null,{"$f":"IF(_ユ市区!A71=\"\",\"\",_ユ市区!A71)","v":"Nagano"},null,null,null,{"$f":"IF(_ユ市区!B71=\"\",\"\",_ユ市区!B71)","v":21},null,null,{"$f":"IF(_ユ市区!A92=\"\",\"\",_ユ市区!A92)","v":"Koga"},null,null,null,{"$f":"IF(_ユ市区!B92=\"\",\"\",_ユ市区!B92)","v":13},null,null,{"$f":"IF(_ユ市区!A113=\"\",\"\",_ユ市区!A113)","v":"Hiratsuka"},null,null,null,{"$f":"IF(_ユ市区!B113=\"\",\"\",_ユ市区!B113)","v":10}]
[{"$f":"IF(_ユ市区!A30=\"\",\"\",_ユ市区!A30)","v":"Itabashi City"},null,null,null,{"$f":"IF(_ユ市区!B30=\"\",\"\",_ユ市区!B30)","v":68},null,null,{"$f":"IF(_ユ市区!A51=\"\",\"\",_ユ市区!A51)","v":"Ichikawa"},null,null,null,{"$f":"IF(_ユ市区!B51=\"\",\"\",_ユ市区!B51)","v":33},null,null,{"$f":"IF(_ユ市区!A72=\"\",\"\",_ユ市区!A72)","v":"Urayasu"},null,null,null,{"$f":"IF(_ユ市区!B72=\"\",\"\",_ユ市区!B72)","v":21},null,null,{"$f":"IF(_ユ市区!A93=\"\",\"\",_ユ市区!A93)","v":"Meguro City"},null,null,null,{"$f":"IF(_ユ市区!B93=\"\",\"\",_ユ市区!B93)","v":13},null,null,{"$f":"IF(_ユ市区!A114=\"\",\"\",_ユ市区!A114)","v":"Hitachi"},null,null,null,{"$f":"IF(_ユ市区!B114=\"\",\"\",_ユ市区!B114)","v":10}]
[{"$f":"IF(_ユ市区!A31=\"\",\"\",_ユ市区!A31)","v":"Koto City"},null,null,null,{"$f":"IF(_ユ市区!B31=\"\",\"\",_ユ市区!B31)","v":64},null,null,{"$f":"IF(_ユ市区!A52=\"\",\"\",_ユ市区!A52)","v":"Kashiwa"},null,null,null,{"$f":"IF(_ユ市区!B52=\"\",\"\",_ユ市区!B52)","v":33},null,null,{"$f":"IF(_ユ市区!A73=\"\",\"\",_ユ市区!A73)","v":"Matsudo"},null,null,null,{"$f":"IF(_ユ市区!B73=\"\",\"\",_ユ市区!B73)","v":20},null,null,{"$f":"IF(_ユ市区!A94=\"\",\"\",_ユ市区!A94)","v":"Ageo"},null,null,null,{"$f":"IF(_ユ市区!B94=\"\",\"\",_ユ市区!B94)","v":12},null,null,{"$f":"IF(_ユ市区!A115=\"\",\"\",_ユ市区!A115)","v":"Iruma"},null,null,null,{"$f":"IF(_ユ市区!B115=\"\",\"\",_ユ市区!B115)","v":10}]
[{"$f":"IF(_ユ市区!A32=\"\",\"\",_ユ市区!A32)","v":"Kyoto"},null,null,null,{"$f":"IF(_ユ市区!B32=\"\",\"\",_ユ市区!B32)","v":57},null,null,{"$f":"IF(_ユ市区!A53=\"\",\"\",_ユ市区!A53)","v":"Kobe"},null,null,null,{"$f":"IF(_ユ市区!B53=\"\",\"\",_ユ市区!B53)","v":33},null,null,{"$f":"IF(_ユ市区!A74=\"\",\"\",_ユ市区!A74)","v":"Maebashi"},null,null,null,{"$f":"IF(_ユ市区!B74=\"\",\"\",_ユ市区!B74)","v":19},null,null,{"$f":"IF(_ユ市区!A95=\"\",\"\",_ユ市区!A95)","v":"Kochi"},null,null,null,{"$f":"IF(_ユ市区!B95=\"\",\"\",_ユ市区!B95)","v":12},null,null,{"$f":"IF(_ユ市区!A116=\"\",\"\",_ユ市区!A116)","v":"Kumagaya"},null,null,null,{"$f":"IF(_ユ市区!B116=\"\",\"\",_ユ市区!B116)","v":10}]
[{"$f":"IF(_ユ市区!A33=\"\",\"\",_ユ市区!A33)","v":"Utsunomiya"},null,null,null,{"$f":"IF(_ユ市区!B33=\"\",\"\",_ユ市区!B33)","v":56},null,null,{"$f":"IF(_ユ市区!A54=\"\",\"\",_ユ市区!A54)","v":"Fuchu"},null,null,null,{"$f":"IF(_ユ市区!B54=\"\",\"\",_ユ市区!B54)","v":31},null,null,{"$f":"IF(_ユ市区!A75=\"\",\"\",_ユ市区!A75)","v":"Nakano City"},null,null,null,{"$f":"IF(_ユ市区!B75=\"\",\"\",_ユ市区!B75)","v":19},null,null,{"$f":"IF(_ユ市区!A96=\"\",\"\",_ユ市区!A96)","v":"Matsuyama"},null,null,null,{"$f":"IF(_ユ市区!B96=\"\",\"\",_ユ市区!B96)","v":12},null,null,{"$f":"IF(_ユ市区!A117=\"\",\"\",_ユ市区!A117)","v":"Nagareyama"},null,null,null,{"$f":"IF(_ユ市区!B117=\"\",\"\",_ユ市区!B117)","v":10}]
[{"$f":"IF(_ユ市区!A34=\"\",\"\",_ユ市区!A34)","v":"Sagamihara"},null,null,null,{"$f":"IF(_ユ市区!B34=\"\",\"\",_ユ市区!B34)","v":55},null,null,{"$f":"IF(_ユ市区!A55=\"\",\"\",_ユ市区!A55)","v":"Sumida City"},null,null,null,{"$f":"IF(_ユ市区!B55=\"\",\"\",_ユ市区!B55)","v":31},null,null,{"$f":"IF(_ユ市区!A76=\"\",\"\",_ユ市区!A76)","v":"Yokosuka"},null,null,null,{"$f":"IF(_ユ市区!B76=\"\",\"\",_ユ市区!B76)","v":19},null,null,{"$f":"IF(_ユ市区!A97=\"\",\"\",_ユ市区!A97)","v":"Nagasaki"},null,null,null,{"$f":"IF(_ユ市区!B97=\"\",\"\",_ユ市区!B97)","v":12},null,null,{"$f":"IF(_ユ市区!A118=\"\",\"\",_ユ市区!A118)","v":"Odawara"},null,null,null,{"$f":"IF(_ユ市区!B118=\"\",\"\",_ユ市区!B118)","v":10}]
[{"$f":"IF(_ユ市区!A35=\"\",\"\",_ユ市区!A35)","v":"Chuo City"},null,null,null,{"$f":"IF(_ユ市区!B35=\"\",\"\",_ユ市区!B35)","v":52},null,null,{"$f":"IF(_ユ市区!A56=\"\",\"\",_ユ市区!A56)","v":"Machida"},null,null,null,{"$f":"IF(_ユ市区!B56=\"\",\"\",_ユ市区!B56)","v":30},null,null,{"$f":"IF(_ユ市区!A77=\"\",\"\",_ユ市区!A77)","v":"Fujisawa"},null,null,null,{"$f":"IF(_ユ市区!B77=\"\",\"\",_ユ市区!B77)","v":18},null,null,{"$f":"IF(_ユ市区!A98=\"\",\"\",_ユ市区!A98)","v":"Oita"},null,null,null,{"$f":"IF(_ユ市区!B98=\"\",\"\",_ユ市区!B98)","v":12},null,null,{"$f":"IF(_ユ市区!A119=\"\",\"\",_ユ市区!A119)","v":"Ome"},null,null,null,{"$f":"IF(_ユ市区!B119=\"\",\"\",_ユ市区!B119)","v":10}]
[{"$f":"IF(_ユ市区!A36=\"\",\"\",_ユ市区!A36)","v":"Nerima City"},null,null,null,{"$f":"IF(_ユ市区!B36=\"\",\"\",_ユ市区!B36)","v":52},null,null,{"$f":"IF(_ユ市区!A57=\"\",\"\",_ユ市区!A57)","v":"Taito City"},null,null,null,{"$f":"IF(_ユ市区!B57=\"\",\"\",_ユ市区!B57)","v":30},null,null,{"$f":"IF(_ユ市区!A78=\"\",\"\",_ユ市区!A78)","v":"Kofu"},null,null,null,{"$f":"IF(_ユ市区!B78=\"\",\"\",_ユ市区!B78)","v":18},null,null,{"$f":"IF(_ユ市区!A99=\"\",\"\",_ユ市区!A99)","v":"Sakai"},null,null,null,{"$f":"IF(_ユ市区!B99=\"\",\"\",_ユ市区!B99)","v":12},null,null,{"$f":"IF(_ユ市区!A120=\"\",\"\",_ユ市区!A120)","v":"Otsu"},null,null,null,{"$f":"IF(_ユ市区!B120=\"\",\"\",_ユ市区!B120)","v":10}]

{"sheet":"ユーザー属性ごとのユーザー数","index":5,"n_rows":32,"n_cols":30,"rows_kept":32,"cut":false,"hidden":false,"merged":[[10,27,10,30],[30,16,30,28],[30,29,30,30],[31,16,31,28],[31,29,31,30],[27,16,27,28],[27,29,27,30],[28,16,28,28],[28,29,28,30],[29,16,29,28],[29,29,29,30],[24,16,24,28],[24,29,24,30],[25,16,25,28],[25,29,25,30],[26,16,26,28],[26,29,26,30],[21,16,21,28],[21,29,21,30],[22,16,22,28],[22,29,22,30],[23,16,23,28],[23,29,23,30],[18,16,18,28],[18,29,18,30],[19,16,19,28],[19,29,19,30],[20,16,20,28],[20,29,20,30],[14,29,14,30],[15,16,15,28],[15,29,15,30],[16,16,16,28],[16,29,16,30],[14,16,14,28],[17,16,17,28],[17,29,17,30],[30,13,30,14],[31,0,31,12],[31,13,31,14],[26,13,26,14],[27,0,27,12],[27,13,27,14],[28,0,28,12],[28,13,28,14],[29,0,29,12],[29,13,29,14],[22,13,22,14],[23,0,23,12],[23,13,23,14],[24,0,24,12],[11,16,11,28],[11,29,11,30],[12,16,12,28],[12,29,12,30],[13,16,13,28],[13,29,13,30],[24,13,24,14],[25,0,25,12],[25,13,25,14],[19,0,19,12],[19,13,19,14],[20,0,20,12],[20,13,20,14],[21,0,21,12],[21,13,21,14],[18,13,18,14],[11,13,11,14],[11,0,11,12],[12,0,12,12],[12,13,12,14],[13,0,13,12],[13,13,13,14],[14,0,14,12],[14,13,14,14],[15,13,15,14],[16,0,16,12],[16,13,16,14],[17,0,17,12],[17,13,17,14],[26,0,26,12],[30,0,30,12],[22,0,22,12],[15,0,15,12],[18,0,18,12]]}
["性別",null,null,null,null,null,null,null,null,null,null,null,null,null,null,null,"年齢層"]
[]
[]
[]
[]
[]
[]
[]
[]
[]
["インタレスト",null,null,null,null,null,null,null,null,null,null,null,null,null,null,null,null,null,null,null,null,null,null,null,null,null,null,"単位：人"]
[{"$f":"IF(_ユインタレスト!A16=\"\",\"\",_ユインタレスト!A16)","v":"Media & Entertainment/Music Lovers"},null,null,null,null,null,null,null,null,null,null,null,null,{"$f":"IF(_ユインタレスト!B16=\"\",\"\",_ユインタレスト!B16)","v":2920},null,null,{"$f":"IF(_ユインタレスト!A37=\"\",\"\",_ユインタレスト!A37)","v":"Lifestyles & Hobbies/Frequently Attends Live Events"},null,null,null,null,null,null,null,null,null,null,null,null,{"$f":"IF(_ユインタレスト!B37=\"\",\"\",_ユインタレスト!B37)","v":1640}]
[{"$f":"IF(_ユインタレスト!A17=\"\",\"\",_ユインタレスト!A17)","v":"Lifestyles & Hobbies/Green Living Enthusiasts"},null,null,null,null,null,null,null,null,null,null,null,null,{"$f":"IF(_ユインタレスト!B17=\"\",\"\",_ユインタレスト!B17)","v":2402},null,null,{"$f":"IF(_ユインタレスト!A38=\"\",\"\",_ユインタレスト!A38)","v":"Technology/Technophiles"},null,null,null,null,null,null,null,null,null,null,null,null,{"$f":"IF(_ユインタレスト!B38=\"\",\"\",_ユインタレスト!B38)","v":1632}]
[{"$f":"IF(_ユインタレスト!A18=\"\",\"\",_ユインタレスト!A18)","v":"News & Politics/Avid News Readers"},null,null,null,null,null,null,null,null,null,null,null,null,{"$f":"IF(_ユインタレスト!B18=\"\",\"\",_ユインタレスト!B18)","v":2275},null,null,{"$f":"IF(_ユインタレスト!A39=\"\",\"\",_ユインタレスト!A39)","v":"Vehicles & Transportation/Auto Enthusiasts"},null,null,null,null,null,null,null,null,null,null,null,null,{"$f":"IF(_ユインタレスト!B39=\"\",\"\",_ユインタレスト!B39)","v":1609}]
[{"$f":"IF(_ユインタレスト!A19=\"\",\"\",_ユインタレスト!A19)","v":"Media & Entertainment/Movie Lovers"},null,null,null,null,null,null,null,null,null,null,null,null,{"$f":"IF(_ユインタレスト!B19=\"\",\"\",_ユインタレスト!B19)","v":2234},null,null,{"$f":"IF(_ユインタレスト!A40=\"\",\"\",_ユインタレスト!A40)","v":"Travel/Travel Buffs"},null,null,null,null,null,null,null,null,null,null,null,null,{"$f":"IF(_ユインタレスト!B40=\"\",\"\",_ユインタレスト!B40)","v":1507}]
[{"$f":"IF(_ユインタレスト!A20=\"\",\"\",_ユインタレスト!A20)","v":"Media & Entertainment/TV Lovers"},null,null,null,null,null,null,null,null,null,null,null,null,{"$f":"IF(_ユインタレスト!B20=\"\",\"\",_ユインタレスト!B20)","v":2213},null,null,{"$f":"IF(_ユインタレスト!A41=\"\",\"\",_ユインタレスト!A41)","v":"Lifestyles & Hobbies/Nightlife Enthusiasts"},null,null,null,null,null,null,null,null,null,null,null,null,{"$f":"IF(_ユインタレスト!B41=\"\",\"\",_ユインタレスト!B41)","v":1483}]
[{"$f":"IF(_ユインタレスト!A21=\"\",\"\",_ユインタレスト!A21)","v":"Shoppers/Value Shoppers"},null,null,null,null,null,null,null,null,null,null,null,null,{"$f":"IF(_ユインタレスト!B21=\"\",\"\",_ユインタレスト!B21)","v":2133},null,null,{"$f":"IF(_ユインタレスト!A42=\"\",\"\",_ユインタレスト!A42)","v":"Home & Garden/Do-It-Yourselfers"},null,null,null,null,null,null,null,null,null,null,null,null,{"$f":"IF(_ユインタレスト!B42=\"\",\"\",_ユインタレスト!B42)","v":1389}]
[{"$f":"IF(_ユインタレスト!A22=\"\",\"\",_ユインタレスト!A22)","v":"Media & Entertainment/Comics & Animation Fans"},null,null,null,null,null,null,null,null,null,null,null,null,{"$f":"IF(_ユインタレスト!B22=\"\",\"\",_ユインタレスト!B22)","v":2057},null,null,{"$f":"IF(_ユインタレスト!A43=\"\",\"\",_ユインタレスト!A43)","v":"Lifestyles & Hobbies/Pet Lovers"},null,null,null,null,null,null,null,null,null,null,null,null,{"$f":"IF(_ユインタレスト!B43=\"\",\"\",_ユインタレスト!B43)","v":1389}]
[{"$f":"IF(_ユインタレスト!A23=\"\",\"\",_ユインタレスト!A23)","v":"Sports & Fitness/Sports Fans"},null,null,null,null,null,null,null,null,null,null,null,null,{"$f":"IF(_ユインタレスト!B23=\"\",\"\",_ユインタレスト!B23)","v":2054},null,null,{"$f":"IF(_ユインタレスト!A44=\"\",\"\",_ユインタレスト!A44)","v":"Media & Entertainment/Book Lovers"},null,null,null,null,null,null,null,null,null,null,null,null,{"$f":"IF(_ユインタレスト!B44=\"\",\"\",_ユインタレスト!B44)","v":1375}]
[{"$f":"IF(_ユインタレスト!A24=\"\",\"\",_ユインタレスト!A24)","v":"Shoppers/Luxury Shoppers"},null,null,null,null,null,null,null,null,null,null,null,null,{"$f":"IF(_ユインタレスト!B24=\"\",\"\",_ユインタレスト!B24)","v":2025},null,null,{"$f":"IF(_ユインタレスト!A45=\"\",\"\",_ユインタレスト!A45)","v":"Food & Dining/Cooking Enthusiasts/30 Minute Chefs"},null,null,null,null,null,null,null,null,null,null,null,null,{"$f":"IF(_ユインタレスト!B45=\"\",\"\",_ユインタレスト!B45)","v":1324}]
[{"$f":"IF(_ユインタレスト!A25=\"\",\"\",_ユインタレスト!A25)","v":"Lifestyles & Hobbies/Business Professionals"},null,null,null,null,null,null,null,null,null,null,null,null,{"$f":"IF(_ユインタレスト!B25=\"\",\"\",_ユインタレスト!B25)","v":1994},null,null,{"$f":"IF(_ユインタレスト!A46=\"\",\"\",_ユインタレスト!A46)","v":"News & Politics/Avid News Readers/Avid Political News Readers"},null,null,null,null,null,null,null,null,null,null,null,null,{"$f":"IF(_ユインタレスト!B46=\"\",\"\",_ユインタレスト!B46)","v":1322}]
[{"$f":"IF(_ユインタレスト!A26=\"\",\"\",_ユインタレスト!A26)","v":"Sports & Fitness/Health & Fitness Buffs"},null,null,null,null,null,null,null,null,null,null,null,null,{"$f":"IF(_ユインタレスト!B26=\"\",\"\",_ユインタレスト!B26)","v":1952},null,null,{"$f":"IF(_ユインタレスト!A47=\"\",\"\",_ユインタレスト!A47)","v":"Food & Dining/Frequently Dines Out/Diners by Meal/Frequently Eats Lunch Out"},null,null,null,null,null,null,null,null,null,null,null,null,{"$f":"IF(_ユインタレスト!B47=\"\",\"\",_ユインタレスト!B47)","v":1280}]
[{"$f":"IF(_ユインタレスト!A27=\"\",\"\",_ユインタレスト!A27)","v":"Lifestyles & Hobbies/Art & Theater Aficionados"},null,null,null,null,null,null,null,null,null,null,null,null,{"$f":"IF(_ユインタレスト!B27=\"\",\"\",_ユインタレスト!B27)","v":1941},null,null,{"$f":"IF(_ユインタレスト!A48=\"\",\"\",_ユインタレスト!A48)","v":"Travel/Business Travelers"},null,null,null,null,null,null,null,null,null,null,null,null,{"$f":"IF(_ユインタレスト!B48=\"\",\"\",_ユインタレスト!B48)","v":1243}]
[{"$f":"IF(_ユインタレスト!A28=\"\",\"\",_ユインタレスト!A28)","v":"Technology/Mobile Enthusiasts"},null,null,null,null,null,null,null,null,null,null,null,null,{"$f":"IF(_ユインタレスト!B28=\"\",\"\",_ユインタレスト!B28)","v":1903},null,null,{"$f":"IF(_ユインタレスト!A49=\"\",\"\",_ユインタレスト!A49)","v":"Beauty & Wellness/Beauty Mavens"},null,null,null,null,null,null,null,null,null,null,null,null,{"$f":"IF(_ユインタレスト!B49=\"\",\"\",_ユインタレスト!B49)","v":1208}]
[{"$f":"IF(_ユインタレスト!A29=\"\",\"\",_ユインタレスト!A29)","v":"Lifestyles & Hobbies/Shutterbugs"},null,null,null,null,null,null,null,null,null,null,null,null,{"$f":"IF(_ユインタレスト!B29=\"\",\"\",_ユインタレスト!B29)","v":1813},null,null,{"$f":"IF(_ユインタレスト!A50=\"\",\"\",_ユインタレスト!A50)","v":"Food & Dining/Coffee Shop Regulars"},null,null,null,null,null,null,null,null,null,null,null,null,{"$f":"IF(_ユインタレスト!B50=\"\",\"\",_ユインタレスト!B50)","v":1185}]
[{"$f":"IF(_ユインタレスト!A30=\"\",\"\",_ユインタレスト!A30)","v":"Food & Dining/Foodies"},null,null,null,null,null,null,null,null,null,null,null,null,{"$f":"IF(_ユインタレスト!B30=\"\",\"\",_ユインタレスト!B30)","v":1811},null,null,{"$f":"IF(_ユインタレスト!A51=\"\",\"\",_ユインタレスト!A51)","v":"Media & Entertainment/Gamers"},null,null,null,null,null,null,null,null,null,null,null,null,{"$f":"IF(_ユインタレスト!B51=\"\",\"\",_ユインタレスト!B51)","v":1184}]
[{"$f":"IF(_ユインタレスト!A31=\"\",\"\",_ユインタレスト!A31)","v":"Media & Entertainment/Music Lovers/World Music Fans"},null,null,null,null,null,null,null,null,null,null,null,null,{"$f":"IF(_ユインタレスト!B31=\"\",\"\",_ユインタレスト!B31)","v":1735},null,null,{"$f":"IF(_ユインタレスト!A52=\"\",\"\",_ユインタレスト!A52)","v":"Lifestyles & Hobbies/Fashionistas"},null,null,null,null,null,null,null,null,null,null,null,null,{"$f":"IF(_ユインタレスト!B52=\"\",\"\",_ユインタレスト!B52)","v":1169}]
[{"$f":"IF(_ユインタレスト!A32=\"\",\"\",_ユインタレスト!A32)","v":"Lifestyles & Hobbies/Outdoor Enthusiasts"},null,null,null,null,null,null,null,null,null,null,null,null,{"$f":"IF(_ユインタレスト!B32=\"\",\"\",_ユインタレスト!B32)","v":1713},null,null,{"$f":"IF(_ユインタレスト!A53=\"\",\"\",_ユインタレスト!A53)","v":"Shoppers/Shopaholics"},null,null,null,null,null,null,null,null,null,null,null,null,{"$f":"IF(_ユインタレスト!B53=\"\",\"\",_ユインタレスト!B53)","v":1156}]
[{"$f":"IF(_ユインタレスト!A33=\"\",\"\",_ユインタレスト!A33)","v":"Beauty & Wellness/Frequently Visits Salons"},null,null,null,null,null,null,null,null,null,null,null,null,{"$f":"IF(_ユインタレスト!B33=\"\",\"\",_ユインタレスト!B33)","v":1702},null,null,{"$f":"IF(_ユインタレスト!A54=\"\",\"\",_ユインタレスト!A54)","v":"Food & Dining/Frequently Dines Out/Diners by Meal/Frequently Eats Dinner Out"},null,null,null,null,null,null,null,null,null,null,null,null,{"$f":"IF(_ユインタレスト!B54=\"\",\"\",_ユインタレスト!B54)","v":1155}]
[{"$f":"IF(_ユインタレスト!A34=\"\",\"\",_ユインタレスト!A34)","v":"Media & Entertainment/Music Lovers/Pop Music Fans"},null,null,null,null,null,null,null,null,null,null,null,null,{"$f":"IF(_ユインタレスト!B34=\"\",\"\",_ユインタレスト!B34)","v":1700},null,null,{"$f":"IF(_ユインタレスト!A55=\"\",\"\",_ユインタレスト!A55)","v":"Shoppers/Shoppers by Store Type/Convenience Store Shoppers"},null,null,null,null,null,null,null,null,null,null,null,null,{"$f":"IF(_ユインタレスト!B55=\"\",\"\",_ユインタレスト!B55)","v":1099}]
[{"$f":"IF(_ユインタレスト!A35=\"\",\"\",_ユインタレスト!A35)","v":"Food & Dining/Fast Food Cravers"},null,null,null,null,null,null,null,null,null,null,null,null,{"$f":"IF(_ユインタレスト!B35=\"\",\"\",_ユインタレスト!B35)","v":1678},null,null,{"$f":"IF(_ユインタレスト!A56=\"\",\"\",_ユインタレスト!A56)","v":"Food & Dining/Cooking Enthusiasts"},null,null,null,null,null,null,null,null,null,null,null,null,{"$f":"IF(_ユインタレスト!B56=\"\",\"\",_ユインタレスト!B56)","v":1063}]
[{"$f":"IF(_ユインタレスト!A36=\"\",\"\",_ユインタレスト!A36)","v":"News & Politics/Avid News Readers/Entertainment News Enthusiasts"},null,null,null,null,null,null,null,null,null,null,null,null,{"$f":"IF(_ユインタレスト!B36=\"\",\"\",_ユインタレスト!B36)","v":1667},null,null,{"$f":"IF(_ユインタレスト!A57=\"\",\"\",_ユインタレスト!A57)","v":"Technology/Social Media Enthusiasts"},null,null,null,null,null,null,null,null,null,null,null,null,{"$f":"IF(_ユインタレスト!B57=\"\",\"\",_ユインタレスト!B57)","v":1031}]

{"sheet":"集客チャンネル","index":6,"n_rows":29,"n_cols":17,"rows_kept":29,"cut":false,"hidden":false,"merged":[[28,0,28,15],[24,16,24,20],[25,16,25,20],[26,16,26,20],[27,16,27,20],[28,16,28,20],[24,0,24,15],[23,16,23,20],[25,0,25,15],[26,0,26,15],[27,0,27,15],[23,0,23,15]]}
[]
[]
[]
[]
[]
[]
[]
[]
[]
[]
[]
[]
[]
[]
[]
[]
[]
[]
[]
[]
[]
[]
[]
["チャンネル",null,null,null,null,null,null,null,null,null,null,null,null,null,null,null,"ユーザー数"]
[{"$f":"IF(_集チャンネル!A16=\"\",\"\",_集チャンネル!A16)","v":"Paid Search"},null,null,null,null,null,null,null,null,null,null,null,null,null,null,null,{"$f":"IF(_集チャンネル!B16=\"\",\"\",_集チャンネル!B16)","v":5827}]
[{"$f":"IF(_集チャンネル!A17=\"\",\"\",_集チャンネル!A17)","v":"Referral"},null,null,null,null,null,null,null,null,null,null,null,null,null,null,null,{"$f":"IF(_集チャンネル!B17=\"\",\"\",_集チャンネル!B17)","v":2919}]
[{"$f":"IF(_集チャンネル!A18=\"\",\"\",_集チャンネル!A18)","v":"Social"},null,null,null,null,null,null,null,null,null,null,null,null,null,null,null,{"$f":"IF(_集チャンネル!B18=\"\",\"\",_集チャンネル!B18)","v":2283}]
[{"$f":"IF(_集チャンネル!A19=\"\",\"\",_集チャンネル!A19)","v":"Direct"},null,null,null,null,null,null,null,null,null,null,null,null,null,null,null,{"$f":"IF(_集チャンネル!B19=\"\",\"\",_集チャンネル!B19)","v":1496}]
[{"$f":"IF(_集チャンネル!A20=\"\",\"\",_集チャンネル!A20)","v":"Organic Search"},null,null,null,null,null,null,null,null,null,null,null,null,null,null,null,{"$f":"IF(_集チャンネル!B20=\"\",\"\",_集チャンネル!B20)","v":163}]

{"sheet":"集客ペイドユーザー数推移","index":7,"n_rows":30,"n_cols":12,"rows_kept":30,"cut":false,"hidden":false,"merged":[[30,4,30,5],[29,0,29,3],[29,4,29,5],[29,7,29,10],[29,11,29,12],[28,0,28,3],[28,4,28,5],[28,7,28,10],[28,11,28,12],[27,0,27,3],[27,4,27,5],[27,7,27,10],[27,11,27,12],[26,0,26,3],[26,4,26,5],[26,7,26,10],[26,11,26,12],[25,0,25,3],[25,4,25,5],[25,7,25,10],[25,11,25,12],[24,0,24,3],[24,4,24,5],[24,7,24,10],[24,11,24,12],[23,0,23,3],[23,4,23,5],[23,7,23,10],[23,11,23,12],[22,0,22,3],[22,4,22,5],[22,7,22,10],[22,11,22,12],[21,0,21,3],[21,4,21,5],[21,7,21,10],[21,11,21,12],[20,0,20,3],[20,4,20,5],[20,7,20,10],[20,11,20,12],[19,0,19,3],[19,4,19,5],[19,7,19,10],[19,11,19,12],[18,0,18,3],[18,4,18,5],[18,7,18,10],[18,11,18,12],[17,0,17,3],[17,4,17,5],[17,7,17,10],[17,11,17,12],[16,0,16,3],[16,4,16,5],[16,7,16,10],[16,11,16,12],[15,0,15,3],[15,4,15,5],[15,7,15,10],[15,11,15,12],[14,0,14,3],[14,4,14,5],[14,7,14,10],[14,11,14,12],[13,0,13,3],[13,4,13,5],[13,7,13,10],[13,11,13,12],[10,0,10,3],[10,4,10,5],[10,7,10,10],[10,11,10,12],[12,0,12,3],[12,4,12,5],[12,7,12,10],[12,11,12,12],[11,0,11,3],[11,4,11,5],[11,7,11,10],[11,11,11,12]]}
["ゆー"]
[]
[]
[]
[]
[]
[]
[]
[]
[]
[{"$f":"IF(_集ペイド!A15=\"\",\"\",_集ペイド!A15)","v":"Date"},null,null,null,{"$f":"IF(_集ペイド!B15=\"\",\"\",_集ペイド!B15)","v":"Users"},null,null,{"$f":"IF(_集ペイド!A15=\"\",\"\",_ユ推移!A15)","v":"Date"},null,null,null,{"$f":"IF(_ユ推移!B15=\"\",\"\",_ユ推移!B15)","v":"Users"}]
[{"$f":"IF(_集ペイド!A16=\"\",\"\",_集ペイド!A16)","v":"2019-07-01"},null,null,null,{"$f":"IF(_集ペイド!B16=\"\",\"\",_集ペイド!B16)","v":5446},null,null,{"$f":"IF(_集ペイド!A35=\"\",\"\",_集ペイド!A35)","v":"2019-07-20"},null,null,null,{"$f":"IF(_集ペイド!B35=\"\",\"\",_集ペイド!B35)","v":4725}]
[{"$f":"IF(_集ペイド!A17=\"\",\"\",_集ペイド!A17)","v":"2019-07-02"},null,null,null,{"$f":"IF(_集ペイド!B17=\"\",\"\",_集ペイド!B17)","v":3123},null,null,{"$f":"IF(_集ペイド!A36=\"\",\"\",_集ペイド!A36)","v":"2019-07-21"},null,null,null,{"$f":"IF(_集ペイド!B36=\"\",\"\",_集ペイド!B36)","v":4814}]
[{"$f":"IF(_集ペイド!A18=\"\",\"\",_集ペイド!A18)","v":"2019-07-03"},null,null,null,{"$f":"IF(_集ペイド!B18=\"\",\"\",_集ペイド!B18)","v":3212},null,null,{"$f":"IF(_集ペイド!A37=\"\",\"\",_集ペイド!A37)","v":"2019-07-22"},null,null,null,{"$f":"IF(_集ペイド!B37=\"\",\"\",_集ペイド!B37)","v":4903}]
[{"$f":"IF(_集ペイド!A19=\"\",\"\",_集ペイド!A19)","v":"2019-07-04"},null,null,null,{"$f":"IF(_集ペイド!B19=\"\",\"\",_集ペイド!B19)","v":3301},null,null,{"$f":"IF(_集ペイド!A38=\"\",\"\",_集ペイド!A38)","v":"2019-07-23"},null,null,null,{"$f":"IF(_集ペイド!B38=\"\",\"\",_集ペイド!B38)","v":4992}]
[{"$f":"IF(_集ペイド!A20=\"\",\"\",_集ペイド!A20)","v":"2019-07-05"},null,null,null,{"$f":"IF(_集ペイド!B20=\"\",\"\",_集ペイド!B20)","v":3390},null,null,{"$f":"IF(_集ペイド!A39=\"\",\"\",_集ペイド!A39)","v":"2019-07-24"},null,null,null,{"$f":"IF(_集ペイド!B39=\"\",\"\",_集ペイド!B39)","v":5081}]
[{"$f":"IF(_集ペイド!A21=\"\",\"\",_集ペイド!A21)","v":"2019-07-06"},null,null,null,{"$f":"IF(_集ペイド!B21=\"\",\"\",_集ペイド!B21)","v":3479},null,null,{"$f":"IF(_集ペイド!A40=\"\",\"\",_集ペイド!A40)","v":"2019-07-25"},null,null,null,{"$f":"IF(_集ペイド!B40=\"\",\"\",_集ペイド!B40)","v":5170}]
[{"$f":"IF(_集ペイド!A22=\"\",\"\",_集ペイド!A22)","v":"2019-07-07"},null,null,null,{"$f":"IF(_集ペイド!B22=\"\",\"\",_集ペイド!B22)","v":3568},null,null,{"$f":"IF(_集ペイド!A41=\"\",\"\",_集ペイド!A41)","v":"2019-07-26"},null,null,null,{"$f":"IF(_集ペイド!B41=\"\",\"\",_集ペイド!B41)","v":5259}]
[{"$f":"IF(_集ペイド!A23=\"\",\"\",_集ペイド!A23)","v":"2019-07-08"},null,null,null,{"$f":"IF(_集ペイド!B23=\"\",\"\",_集ペイド!B23)","v":3657},null,null,{"$f":"IF(_集ペイド!A42=\"\",\"\",_集ペイド!A42)","v":"2019-07-27"},null,null,null,{"$f":"IF(_集ペイド!B42=\"\",\"\",_集ペイド!B42)","v":5348}]
[{"$f":"IF(_集ペイド!A24=\"\",\"\",_集ペイド!A24)","v":"2019-07-09"},null,null,null,{"$f":"IF(_集ペイド!B24=\"\",\"\",_集ペイド!B24)","v":3746},null,null,{"$f":"IF(_集ペイド!A43=\"\",\"\",_集ペイド!A43)","v":"2019-07-28"},null,null,null,{"$f":"IF(_集ペイド!B43=\"\",\"\",_集ペイド!B43)","v":5437}]
[{"$f":"IF(_集ペイド!A25=\"\",\"\",_集ペイド!A25)","v":"2019-07-10"},null,null,null,{"$f":"IF(_集ペイド!B25=\"\",\"\",_集ペイド!B25)","v":3835},null,null,{"$f":"IF(_集ペイド!A44=\"\",\"\",_集ペイド!A44)","v":"2019-07-29"},null,null,null,{"$f":"IF(_集ペイド!B44=\"\",\"\",_集ペイド!B44)","v":5526}]
[{"$f":"IF(_集ペイド!A26=\"\",\"\",_集ペイド!A26)","v":"2019-07-11"},null,null,null,{"$f":"IF(_集ペイド!B26=\"\",\"\",_集ペイド!B26)","v":3924},null,null,{"$f":"IF(_集ペイド!A45=\"\",\"\",_集ペイド!A45)","v":"2019-07-30"},null,null,null,{"$f":"IF(_集ペイド!B45=\"\",\"\",_集ペイド!B45)","v":5615}]
[{"$f":"IF(_集ペイド!A27=\"\",\"\",_集ペイド!A27)","v":"2019-07-12"},null,null,null,{"$f":"IF(_集ペイド!B27=\"\",\"\",_集ペイド!B27)","v":4013},null,null,{"$f":"IF(_集ペイド!A46=\"\",\"\",_集ペイド!A46)","v":"2019-07-31"},null,null,null,{"$f":"IF(_集ペイド!B46=\"\",\"\",_集ペイド!B46)","v":5615}]
[{"$f":"IF(_集ペイド!A28=\"\",\"\",_集ペイド!A28)","v":"2019-07-13"},null,null,null,{"$f":"IF(_集ペイド!B28=\"\",\"\",_集ペイド!B28)","v":4102},null,null,{"$f":"IF(_集ペイド!A47=\"\",\"\",_集ペイド!A47)","v":""},null,null,null,{"$f":"IF(_集ペイド!B47=\"\",\"\",_集ペイド!B47)","v":""}]
[{"$f":"IF(_集ペイド!A29=\"\",\"\",_集ペイド!A29)","v":"2019-07-14"},null,null,null,{"$f":"IF(_集ペイド!B29=\"\",\"\",_集ペイド!B29)","v":4191},null,null,{"$f":"IF(_集ペイド!A48=\"\",\"\",_集ペイド!A48)","v":""},null,null,null,{"$f":"IF(_集ペイド!B48=\"\",\"\",_集ペイド!B48)","v":""}]
[{"$f":"IF(_集ペイド!A30=\"\",\"\",_集ペイド!A30)","v":"2019-07-15"},null,null,null,{"$f":"IF(_集ペイド!B30=\"\",\"\",_集ペイド!B30)","v":4280},null,null,{"$f":"IF(_集ペイド!A49=\"\",\"\",_集ペイド!A49)","v":""},null,null,null,{"$f":"IF(_集ペイド!B49=\"\",\"\",_集ペイド!B49)","v":""}]
[{"$f":"IF(_集ペイド!A31=\"\",\"\",_集ペイド!A31)","v":"2019-07-16"},null,null,null,{"$f":"IF(_集ペイド!B31=\"\",\"\",_集ペイド!B31)","v":4369},null,null,{"$f":"IF(_集ペイド!A50=\"\",\"\",_集ペイド!A50)","v":""},null,null,null,{"$f":"IF(_集ペイド!B50=\"\",\"\",_集ペイド!B50)","v":""}]
[{"$f":"IF(_集ペイド!A32=\"\",\"\",_集ペイド!A32)","v":"2019-07-17"},null,null,null,{"$f":"IF(_集ペイド!B32=\"\",\"\",_集ペイド!B32)","v":4458},null,null,{"$f":"IF(_集ペイド!A51=\"\",\"\",_集ペイド!A51)","v":""},null,null,null,{"$f":"IF(_集ペイド!B51=\"\",\"\",_集ペイド!B51)","v":""}]
[{"$f":"IF(_集ペイド!A33=\"\",\"\",_集ペイド!A33)","v":"2019-07-18"},null,null,null,{"$f":"IF(_集ペイド!B33=\"\",\"\",_集ペイド!B33)","v":4547},null,null,{"$f":"IF(_集ペイド!A52=\"\",\"\",_集ペイド!A52)","v":""},null,null,null,{"$f":"IF(_集ペイド!B52=\"\",\"\",_集ペイド!B52)","v":""}]
[{"$f":"IF(_集ペイド!A34=\"\",\"\",_集ペイド!A34)","v":"2019-07-19"},null,null,null,{"$f":"IF(_集ペイド!B34=\"\",\"\",_集ペイド!B34)","v":4636},null,null,{"$f":"IF(_集ペイド!A53=\"\",\"\",_集ペイド!A53)","v":""},null,null,null,{"$f":"IF(_集ペイド!B53=\"\",\"\",_集ペイド!B53)","v":""}]

{"sheet":"集客キーワード","index":8,"n_rows":33,"n_cols":41,"rows_kept":33,"cut":false,"hidden":false,"merged":[[1,16,1,20],[2,16,2,20],[3,16,3,20],[15,16,15,20],[16,16,16,20],[17,16,17,20],[18,16,18,20],[5,36,5,37],[5,38,5,39],[3,36,3,37],[3,38,3,39],[12,38,12,39],[16,22,16,33],[16,36,16,37],[16,38,16,39],[5,40,5,42],[6,36,6,37],[4,16,4,20],[5,16,5,20],[6,16,6,20],[11,16,11,20],[12,16,12,20],[19,16,19,20],[20,16,20,20],[8,36,8,37],[8,38,8,39],[8,40,8,42],[9,22,9,33],[9,36,9,37],[9,38,9,39],[9,40,9,42],[6,38,6,39],[6,40,6,42],[7,22,7,33],[7,36,7,37],[7,38,7,39],[7,40,7,42],[12,22,12,33],[12,36,12,37],[21,16,21,20],[22,16,22,20],[23,16,23,20],[24,16,24,20],[7,16,7,20],[8,16,8,20],[9,16,9,20],[10,16,10,20],[13,16,13,20],[14,16,14,20],[1,12,1,15],[2,12,2,15],[3,12,3,15],[4,12,4,15],[5,12,5,15],[6,12,6,15],[7,12,7,15],[8,12,8,15],[9,12,9,15],[30,12,30,15],[31,12,31,15],[32,12,32,15],[32,16,32,20],[22,12,22,15],[23,12,23,15],[24,12,24,15],[25,12,25,15],[26,12,26,15],[27,12,27,15],[31,16,31,20],[25,16,25,20],[26,16,26,20],[27,16,27,20],[28,16,28,20],[29,16,29,20],[30,16,30,20],[13,0,13,11],[2,0,2,11],[3,0,3,11],[4,0,4,11],[5,0,5,11],[6,0,6,11],[7,0,7,11],[28,12,28,15],[29,12,29,15],[16,12,16,15],[17,12,17,15],[18,12,18,15],[19,12,19,15],[20,12,20,15],[21,12,21,15],[10,12,10,15],[11,12,11,15],[12,12,12,15],[13,12,13,15],[14,12,14,15],[15,12,15,15],[32,0,32,11],[1,22,1,33],[1,34,1,35],[3,22,3,33],[5,22,5,33],[6,22,6,33],[8,22,8,33],[28,0,28,11],[29,0,29,11],[30,0,30,11],[31,0,31,11],[20,0,20,11],[21,0,21,11],[14,0,14,11],[15,0,15,11],[16,0,16,11],[17,0,17,11],[18,0,18,11],[19,0,19,11],[8,0,8,11],[9,0,9,11],[10,0,10,11],[11,0,11,11],[12,0,12,11],[3,40,3,42],[4,22,4,33],[4,36,4,37],[4,38,4,39],[4,40,4,42],[1,36,1,37],[1,38,1,39],[1,40,1,42],[2,22,2,33],[2,36,2,37],[2,38,2,39],[2,40,2,42],[12,40,12,42],[13,22,13,33],[13,36,13,37],[13,38,13,39],[13,40,13,42],[10,22,10,33],[10,36,10,37],[10,38,10,39],[10,40,10,42],[11,22,11,33],[11,36,11,37],[11,38,11,39],[11,40,11,42],[16,40,16,42],[17,22,17,33],[17,36,17,37],[17,38,17,39],[17,40,17,42],[14,22,14,33],[14,36,14,37],[14,38,14,39],[14,40,14,42],[15,22,15,33],[15,36,15,37],[15,38,15,39],[15,40,15,42],[20,22,20,33],[20,36,20,37],[20,38,20,39],[20,40,20,42],[21,22,21,33],[21,36,21,37],[21,38,21,39],[21,40,21,42],[18,22,18,33],[18,36,18,37],[18,38,18,39],[18,40,18,42],[19,22,19,33],[19,36,19,37],[19,38,19,39],[19,40,19,42],[24,22,24,33],[24,36,24,37],[24,38,24,39],[24,40,24,42],[25,22,25,33],[25,36,25,37],[25,38,25,39],[25,40,25,42],[22,22,22,33],[22,36,22,37],[22,38,22,39],[22,40,22,42],[23,22,23,33],[23,36,23,37],[23,38,23,39],[23,40,23,42],[28,22,28,33],[28,36,28,37],[28,38,28,39],[28,40,28,42],[29,22,29,33],[29,36,29,37],[29,38,29,39],[29,40,29,42],[26,22,26,33],[26,36,26,37],[26,38,26,39],[26,40,26,42],[27,22,27,33],[27,36,27,37],[27,38,27,39],[27,40,27,42],[32,22,32,33],[32,36,32,37],[32,38,32,39],[32,40,32,42],[30,22,30,33],[30,36,30,37],[30,38,30,39],[30,40,30,42],[31,22,31,33],[31,36,31,37],[31,38,31,39],[31,40,31,42]]}
["検索キーワード",null,null,null,null,null,null,null,null,null,null,null,null,null,null,null,null,null,null,null,null,null,"検索キーワード(Googleサーチコンソール)"]
[{"$f":"IF(_集キーワード!A15=\"\",\"\",_集キーワード!A15)","v":"Keyword"},null,null,null,null,null,null,null,null,null,null,null,{"$f":"IF(_集キーワード!B15=\"\",\"\",_集キーワード!B15)","v":"Source"},null,null,null,{"$f":"IF(_集キーワード!C15=\"\",\"\",_集キーワード!C15)","v":"Organic Searches"},null,null,null,null,null,{"$f":"IF(_console!A1=\"\",\"\",_console!A1)","v":"Query"},null,null,null,null,null,null,null,null,null,null,null,{"$f":"IF(_console!B1=\"\",\"\",_console!B1)","v":"Clicks"},null,{"$f":"IF(_console!C1=\"\",\"\",_console!C1)","v":"Impressions"},null,{"$f":"IF(_console!D1=\"\",\"\",_console!D1)","v":"CTR"},null,{"$f":"IF(_console!E1=\"\",\"\",_console!E1)","v":"Position"}]
[{"$f":"IF(_集キーワード!A16=\"\",\"\",_集キーワード!A16)","v":"(not provided)"},null,null,null,null,null,null,null,null,null,null,null,{"$f":"IF(_集キーワード!B16=\"\",\"\",_集キーワード!B16)","v":"google"},null,null,null,{"$f":"IF(_集キーワード!C16=\"\",\"\",_集キーワード!C16)","v":137},null,null,null,null,null,{"$f":"IF(_console!A2=\"\",\"\",_console!A2)","v":"putty 日本語化"},null,null,null,null,null,null,null,null,null,null,null,{"$f":"IF(_console!B2=\"\",\"\",_console!B2)","v":177},null,{"$f":"IF(_console!C2=\"\",\"\",_console!C2)","v":1912},null,{"$f":"IF(_console!D2=\"\",\"\",_console!D2)","v":9.2600000000000002E-2},null,{"$f":"IF(_console!E2=\"\",\"\",_console!E2)","v":6.5}]
[{"$f":"IF(_集キーワード!A17=\"\",\"\",_集キーワード!A17)","v":"(not provided)"},null,null,null,null,null,null,null,null,null,null,null,{"$f":"IF(_集キーワード!B17=\"\",\"\",_集キーワード!B17)","v":"yahoo"},null,null,null,{"$f":"IF(_集キーワード!C17=\"\",\"\",_集キーワード!C17)","v":27},null,null,null,null,null,{"$f":"IF(_console!A3=\"\",\"\",_console!A3)","v":"putty 日本語"},null,null,null,null,null,null,null,null,null,null,null,{"$f":"IF(_console!B3=\"\",\"\",_console!B3)","v":130},null,{"$f":"IF(_console!C3=\"\",\"\",_console!C3)","v":5986},null,{"$f":"IF(_console!D3=\"\",\"\",_console!D3)","v":2.1700000000000001E-2},null,{"$f":"IF(_console!E3=\"\",\"\",_console!E3)","v":9.3000000000000007}]
[{"$f":"IF(_集キーワード!A18=\"\",\"\",_集キーワード!A18)","v":"ホームページ制作"},null,null,null,null,null,null,null,null,null,null,null,{"$f":"IF(_集キーワード!B18=\"\",\"\",_集キーワード!B18)","v":"yahoo"},null,null,null,{"$f":"IF(_集キーワード!C18=\"\",\"\",_集キーワード!C18)","v":2},null,null,null,null,null,{"$f":"IF(_console!A4=\"\",\"\",_console!A4)","v":"zip パーミッション"},null,null,null,null,null,null,null,null,null,null,null,{"$f":"IF(_console!B4=\"\",\"\",_console!B4)","v":80},null,{"$f":"IF(_console!C4=\"\",\"\",_console!C4)","v":181},null,{"$f":"IF(_console!D4=\"\",\"\",_console!D4)","v":0.442},null,{"$f":"IF(_console!E4=\"\",\"\",_console!E4)","v":1.1000000000000001}]
[{"$f":"IF(_集キーワード!A19=\"\",\"\",_集キーワード!A19)","v":"(not set)"},null,null,null,null,null,null,null,null,null,null,null,{"$f":"IF(_集キーワード!B19=\"\",\"\",_集キーワード!B19)","v":"google"},null,null,null,{"$f":"IF(_集キーワード!C19=\"\",\"\",_集キーワード!C19)","v":1},null,null,null,null,null,{"$f":"IF(_console!A5=\"\",\"\",_console!A5)","v":"putty 日本語 設定"},null,null,null,null,null,null,null,null,null,null,null,{"$f":"IF(_console!B5=\"\",\"\",_console!B5)","v":79},null,{"$f":"IF(_console!C5=\"\",\"\",_console!C5)","v":490},null,{"$f":"IF(_console!D5=\"\",\"\",_console!D5)","v":0.16120000000000001},null,{"$f":"IF(_console!E5=\"\",\"\",_console!E5)","v":6}]
[{"$f":"IF(_集キーワード!A20=\"\",\"\",_集キーワード!A20)","v":"(not set)"},null,null,null,null,null,null,null,null,null,null,null,{"$f":"IF(_集キーワード!B20=\"\",\"\",_集キーワード!B20)","v":"(direct)"},null,null,null,{"$f":"IF(_集キーワード!C20=\"\",\"\",_集キーワード!C20)","v":0},null,null,null,null,null,{"$f":"IF(_console!A6=\"\",\"\",_console!A6)","v":"linux zip パーミッション"},null,null,null,null,null,null,null,null,null,null,null,{"$f":"IF(_console!B6=\"\",\"\",_console!B6)","v":51},null,{"$f":"IF(_console!C6=\"\",\"\",_console!C6)","v":116},null,{"$f":"IF(_console!D6=\"\",\"\",_console!D6)","v":0.43969999999999998},null,{"$f":"IF(_console!E6=\"\",\"\",_console!E6)","v":1}]
[{"$f":"IF(_集キーワード!A21=\"\",\"\",_集キーワード!A21)","v":"(not set)"},null,null,null,null,null,null,null,null,null,null,null,{"$f":"IF(_集キーワード!B21=\"\",\"\",_集キーワード!B21)","v":"222.16.100.102"},null,null,null,{"$f":"IF(_集キーワード!C21=\"\",\"\",_集キーワード!C21)","v":0},null,null,null,null,null,{"$f":"IF(_console!A7=\"\",\"\",_console!A7)","v":"olfoldercontacts"},null,null,null,null,null,null,null,null,null,null,null,{"$f":"IF(_console!B7=\"\",\"\",_console!B7)","v":38},null,{"$f":"IF(_console!C7=\"\",\"\",_console!C7)","v":211},null,{"$f":"IF(_console!D7=\"\",\"\",_console!D7)","v":0.18010000000000001},null,{"$f":"IF(_console!E7=\"\",\"\",_console!E7)","v":6}]
[{"$f":"IF(_集キーワード!A22=\"\",\"\",_集キーワード!A22)","v":"(not set)"},null,null,null,null,null,null,null,null,null,null,null,{"$f":"IF(_集キーワード!B22=\"\",\"\",_集キーワード!B22)","v":"102.32.0.142:10080"},null,null,null,{"$f":"IF(_集キーワード!C22=\"\",\"\",_集キーワード!C22)","v":0},null,null,null,null,null,{"$f":"IF(_console!A8=\"\",\"\",_console!A8)","v":"olfolderinbox"},null,null,null,null,null,null,null,null,null,null,null,{"$f":"IF(_console!B8=\"\",\"\",_console!B8)","v":31},null,{"$f":"IF(_console!C8=\"\",\"\",_console!C8)","v":790},null,{"$f":"IF(_console!D8=\"\",\"\",_console!D8)","v":3.9199999999999999E-2},null,{"$f":"IF(_console!E8=\"\",\"\",_console!E8)","v":7.9}]
[{"$f":"IF(_集キーワード!A23=\"\",\"\",_集キーワード!A23)","v":"(not set)"},null,null,null,null,null,null,null,null,null,null,null,{"$f":"IF(_集キーワード!B23=\"\",\"\",_集キーワード!B23)","v":"adwords.corp.google.com"},null,null,null,{"$f":"IF(_集キーワード!C23=\"\",\"\",_集キーワード!C23)","v":0},null,null,null,null,null,{"$f":"IF(_console!A9=\"\",\"\",_console!A9)","v":"outlook vba 返信メール作成"},null,null,null,null,null,null,null,null,null,null,null,{"$f":"IF(_console!B9=\"\",\"\",_console!B9)","v":28},null,{"$f":"IF(_console!C9=\"\",\"\",_console!C9)","v":498},null,{"$f":"IF(_console!D9=\"\",\"\",_console!D9)","v":5.62E-2},null,{"$f":"IF(_console!E9=\"\",\"\",_console!E9)","v":8.1999999999999993}]
[{"$f":"IF(_集キーワード!A24=\"\",\"\",_集キーワード!A24)","v":"(not set)"},null,null,null,null,null,null,null,null,null,null,null,{"$f":"IF(_集キーワード!B24=\"\",\"\",_集キーワード!B24)","v":"asahi.com"},null,null,null,{"$f":"IF(_集キーワード!C24=\"\",\"\",_集キーワード!C24)","v":0},null,null,null,null,null,{"$f":"IF(_console!A10=\"\",\"\",_console!A10)","v":"patch コマンド"},null,null,null,null,null,null,null,null,null,null,null,{"$f":"IF(_console!B10=\"\",\"\",_console!B10)","v":23},null,{"$f":"IF(_console!C10=\"\",\"\",_console!C10)","v":2414},null,{"$f":"IF(_console!D10=\"\",\"\",_console!D10)","v":9.4999999999999998E-3},null,{"$f":"IF(_console!E10=\"\",\"\",_console!E10)","v":9.4}]
[{"$f":"IF(_集キーワード!A25=\"\",\"\",_集キーワード!A25)","v":"(not set)"},null,null,null,null,null,null,null,null,null,null,null,{"$f":"IF(_集キーワード!B25=\"\",\"\",_集キーワード!B25)","v":"blog.livedoor.jp"},null,null,null,{"$f":"IF(_集キーワード!C25=\"\",\"\",_集キーワード!C25)","v":0},null,null,null,null,null,{"$f":"IF(_console!A11=\"\",\"\",_console!A11)","v":"zip パーミッション 保持"},null,null,null,null,null,null,null,null,null,null,null,{"$f":"IF(_console!B11=\"\",\"\",_console!B11)","v":20},null,{"$f":"IF(_console!C11=\"\",\"\",_console!C11)","v":53},null,{"$f":"IF(_console!D11=\"\",\"\",_console!D11)","v":0.37740000000000001},null,{"$f":"IF(_console!E11=\"\",\"\",_console!E11)","v":1}]
[{"$f":"IF(_集キーワード!A26=\"\",\"\",_集キーワード!A26)","v":"(not set)"},null,null,null,null,null,null,null,null,null,null,null,{"$f":"IF(_集キーワード!B26=\"\",\"\",_集キーワード!B26)","v":"cse.google.com"},null,null,null,{"$f":"IF(_集キーワード!C26=\"\",\"\",_集キーワード!C26)","v":0},null,null,null,null,null,{"$f":"IF(_console!A12=\"\",\"\",_console!A12)","v":"outlook vba"},null,null,null,null,null,null,null,null,null,null,null,{"$f":"IF(_console!B12=\"\",\"\",_console!B12)","v":17},null,{"$f":"IF(_console!C12=\"\",\"\",_console!C12)","v":560},null,{"$f":"IF(_console!D12=\"\",\"\",_console!D12)","v":3.04E-2},null,{"$f":"IF(_console!E12=\"\",\"\",_console!E12)","v":30.6}]
[{"$f":"IF(_集キーワード!A27=\"\",\"\",_集キーワード!A27)","v":"(not set)"},null,null,null,null,null,null,null,null,null,null,null,{"$f":"IF(_集キーワード!B27=\"\",\"\",_集キーワード!B27)","v":"cse.google.com.ph"},null,null,null,{"$f":"IF(_集キーワード!C27=\"\",\"\",_集キーワード!C27)","v":0},null,null,null,null,null,{"$f":"IF(_console!A13=\"\",\"\",_console!A13)","v":"outlook vba 添付ファイル 開く"},null,null,null,null,null,null,null,null,null,null,null,{"$f":"IF(_console!B13=\"\",\"\",_console!B13)","v":13},null,{"$f":"IF(_console!C13=\"\",\"\",_console!C13)","v":161},null,{"$f":"IF(_console!D13=\"\",\"\",_console!D13)","v":8.0699999999999994E-2},null,{"$f":"IF(_console!E13=\"\",\"\",_console!E13)","v":9.6999999999999993}]
[{"$f":"IF(_集キーワード!A28=\"\",\"\",_集キーワード!A28)","v":"(not set)"},null,null,null,null,null,null,null,null,null,null,null,{"$f":"IF(_集キーワード!B28=\"\",\"\",_集キーワード!B28)","v":"digital.asahi.com"},null,null,null,{"$f":"IF(_集キーワード!C28=\"\",\"\",_集キーワード!C28)","v":0},null,null,null,null,null,{"$f":"IF(_console!A14=\"\",\"\",_console!A14)","v":"getdefaultfolder"},null,null,null,null,null,null,null,null,null,null,null,{"$f":"IF(_console!B14=\"\",\"\",_console!B14)","v":10},null,{"$f":"IF(_console!C14=\"\",\"\",_console!C14)","v":802},null,{"$f":"IF(_console!D14=\"\",\"\",_console!D14)","v":1.2500000000000001E-2},null,{"$f":"IF(_console!E14=\"\",\"\",_console!E14)","v":12.1}]
[{"$f":"IF(_集キーワード!A29=\"\",\"\",_集キーワード!A29)","v":"(not set)"},null,null,null,null,null,null,null,null,null,null,null,{"$f":"IF(_集キーワード!B29=\"\",\"\",_集キーワード!B29)","v":"download.co.jp"},null,null,null,{"$f":"IF(_集キーワード!C29=\"\",\"\",_集キーワード!C29)","v":0},null,null,null,null,null,{"$f":"IF(_console!A15=\"\",\"\",_console!A15)","v":"getdefaultfolder(6)"},null,null,null,null,null,null,null,null,null,null,null,{"$f":"IF(_console!B15=\"\",\"\",_console!B15)","v":10},null,{"$f":"IF(_console!C15=\"\",\"\",_console!C15)","v":316},null,{"$f":"IF(_console!D15=\"\",\"\",_console!D15)","v":3.1600000000000003E-2},null,{"$f":"IF(_console!E15=\"\",\"\",_console!E15)","v":9.3000000000000007}]
[{"$f":"IF(_集キーワード!A30=\"\",\"\",_集キーワード!A30)","v":"(not set)"},null,null,null,null,null,null,null,null,null,null,null,{"$f":"IF(_集キーワード!B30=\"\",\"\",_集キーワード!B30)","v":"eto.lightning.force.com"},null,null,null,{"$f":"IF(_集キーワード!C30=\"\",\"\",_集キーワード!C30)","v":0},null,null,null,null,null,{"$f":"IF(_console!A16=\"\",\"\",_console!A16)","v":"smarty 変数名 動的"},null,null,null,null,null,null,null,null,null,null,null,{"$f":"IF(_console!B16=\"\",\"\",_console!B16)","v":10},null,{"$f":"IF(_console!C16=\"\",\"\",_console!C16)","v":127},null,{"$f":"IF(_console!D16=\"\",\"\",_console!D16)","v":7.8700000000000006E-2},null,{"$f":"IF(_console!E16=\"\",\"\",_console!E16)","v":7.8}]
[{"$f":"IF(_集キーワード!A31=\"\",\"\",_集キーワード!A31)","v":"(not set)"},null,null,null,null,null,null,null,null,null,null,null,{"$f":"IF(_集キーワード!B31=\"\",\"\",_集キーワード!B31)","v":"facebook.com"},null,null,null,{"$f":"IF(_集キーワード!C31=\"\",\"\",_集キーワード!C31)","v":0},null,null,null,null,null,{"$f":"IF(_console!A17=\"\",\"\",_console!A17)","v":"patchコマンド"},null,null,null,null,null,null,null,null,null,null,null,{"$f":"IF(_console!B17=\"\",\"\",_console!B17)","v":9},null,{"$f":"IF(_console!C17=\"\",\"\",_console!C17)","v":441},null,{"$f":"IF(_console!D17=\"\",\"\",_console!D17)","v":2.0400000000000001E-2},null,{"$f":"IF(_console!E17=\"\",\"\",_console!E17)","v":9.1}]
[{"$f":"IF(_集キーワード!A32=\"\",\"\",_集キーワード!A32)","v":"(not set)"},null,null,null,null,null,null,null,null,null,null,null,{"$f":"IF(_集キーワード!B32=\"\",\"\",_集キーワード!B32)","v":"hayabusa3.2ch.sc"},null,null,null,{"$f":"IF(_集キーワード!C32=\"\",\"\",_集キーワード!C32)","v":0},null,null,null,null,null,{"$f":"IF(_console!A18=\"\",\"\",_console!A18)","v":"putty ダウンロード 日本語"},null,null,null,null,null,null,null,null,null,null,null,{"$f":"IF(_console!B18=\"\",\"\",_console!B18)","v":9},null,{"$f":"IF(_console!C18=\"\",\"\",_console!C18)","v":265},null,{"$f":"IF(_console!D18=\"\",\"\",_console!D18)","v":3.4000000000000002E-2},null,{"$f":"IF(_console!E18=\"\",\"\",_console!E18)","v":8.5}]
[{"$f":"IF(_集キーワード!A33=\"\",\"\",_集キーワード!A33)","v":"(not set)"},null,null,null,null,null,null,null,null,null,null,null,{"$f":"IF(_集キーワード!B33=\"\",\"\",_集キーワード!B33)","v":"infith.com"},null,null,null,{"$f":"IF(_集キーワード!C33=\"\",\"\",_集キーワード!C33)","v":0},null,null,null,null,null,{"$f":"IF(_console!A19=\"\",\"\",_console!A19)","v":"outlook vba find"},null,null,null,null,null,null,null,null,null,null,null,{"$f":"IF(_console!B19=\"\",\"\",_console!B19)","v":8},null,{"$f":"IF(_console!C19=\"\",\"\",_console!C19)","v":105},null,{"$f":"IF(_console!D19=\"\",\"\",_console!D19)","v":7.6200000000000004E-2},null,{"$f":"IF(_console!E19=\"\",\"\",_console!E19)","v":6.7}]
[{"$f":"IF(_集キーワード!A34=\"\",\"\",_集キーワード!A34)","v":"(not set)"},null,null,null,null,null,null,null,null,null,null,null,{"$f":"IF(_集キーワード!B34=\"\",\"\",_集キーワード!B34)","v":"itest.5ch.net"},null,null,null,{"$f":"IF(_集キーワード!C34=\"\",\"\",_集キーワード!C34)","v":0},null,null,null,null,null,{"$f":"IF(_console!A20=\"\",\"\",_console!A20)","v":"putty 日本語 ダウンロード 窓の杜"},null,null,null,null,null,null,null,null,null,null,null,{"$f":"IF(_console!B20=\"\",\"\",_console!B20)","v":8},null,{"$f":"IF(_console!C20=\"\",\"\",_console!C20)","v":341},null,{"$f":"IF(_console!D20=\"\",\"\",_console!D20)","v":2.35E-2},null,{"$f":"IF(_console!E20=\"\",\"\",_console!E20)","v":8.4}]
[{"$f":"IF(_集キーワード!A35=\"\",\"\",_集キーワード!A35)","v":"(not set)"},null,null,null,null,null,null,null,null,null,null,null,{"$f":"IF(_集キーワード!B35=\"\",\"\",_集キーワード!B35)","v":"jp.mg5.mail.yahoo.co.jp"},null,null,null,{"$f":"IF(_集キーワード!C35=\"\",\"\",_集キーワード!C35)","v":0},null,null,null,null,null,{"$f":"IF(_console!A21=\"\",\"\",_console!A21)","v":"bugzilla インストール"},null,null,null,null,null,null,null,null,null,null,null,{"$f":"IF(_console!B21=\"\",\"\",_console!B21)","v":7},null,{"$f":"IF(_console!C21=\"\",\"\",_console!C21)","v":97},null,{"$f":"IF(_console!D21=\"\",\"\",_console!D21)","v":7.22E-2},null,{"$f":"IF(_console!E21=\"\",\"\",_console!E21)","v":8.6999999999999993}]
[{"$f":"IF(_集キーワード!A36=\"\",\"\",_集キーワード!A36)","v":"(not set)"},null,null,null,null,null,null,null,null,null,null,null,{"$f":"IF(_集キーワード!B36=\"\",\"\",_集キーワード!B36)","v":"kyodemo.net"},null,null,null,{"$f":"IF(_集キーワード!C36=\"\",\"\",_集キーワード!C36)","v":0},null,null,null,null,null,{"$f":"IF(_console!A22=\"\",\"\",_console!A22)","v":"openvpn float"},null,null,null,null,null,null,null,null,null,null,null,{"$f":"IF(_console!B22=\"\",\"\",_console!B22)","v":7},null,{"$f":"IF(_console!C22=\"\",\"\",_console!C22)","v":46},null,{"$f":"IF(_console!D22=\"\",\"\",_console!D22)","v":0.1522},null,{"$f":"IF(_console!E22=\"\",\"\",_console!E22)","v":7.2}]
[{"$f":"IF(_集キーワード!A37=\"\",\"\",_集キーワード!A37)","v":"(not set)"},null,null,null,null,null,null,null,null,null,null,null,{"$f":"IF(_集キーワード!B37=\"\",\"\",_集キーワード!B37)","v":"l.facebook.com"},null,null,null,{"$f":"IF(_集キーワード!C37=\"\",\"\",_集キーワード!C37)","v":0},null,null,null,null,null,{"$f":"IF(_console!A23=\"\",\"\",_console!A23)","v":"patch directory"},null,null,null,null,null,null,null,null,null,null,null,{"$f":"IF(_console!B23=\"\",\"\",_console!B23)","v":7},null,{"$f":"IF(_console!C23=\"\",\"\",_console!C23)","v":39},null,{"$f":"IF(_console!D23=\"\",\"\",_console!D23)","v":0.17949999999999999},null,{"$f":"IF(_console!E23=\"\",\"\",_console!E23)","v":4.0999999999999996}]
[{"$f":"IF(_集キーワード!A38=\"\",\"\",_集キーワード!A38)","v":"(not set)"},null,null,null,null,null,null,null,null,null,null,null,{"$f":"IF(_集キーワード!B38=\"\",\"\",_集キーワード!B38)","v":"l.moapi.net"},null,null,null,{"$f":"IF(_集キーワード!C38=\"\",\"\",_集キーワード!C38)","v":0},null,null,null,null,null,{"$f":"IF(_console!A24=\"\",\"\",_console!A24)","v":"putty 日本語 ダウンロード"},null,null,null,null,null,null,null,null,null,null,null,{"$f":"IF(_console!B24=\"\",\"\",_console!B24)","v":7},null,{"$f":"IF(_console!C24=\"\",\"\",_console!C24)","v":238},null,{"$f":"IF(_console!D24=\"\",\"\",_console!D24)","v":2.9399999999999999E-2},null,{"$f":"IF(_console!E24=\"\",\"\",_console!E24)","v":9}]
[{"$f":"IF(_集キーワード!A39=\"\",\"\",_集キーワード!A39)","v":"(not set)"},null,null,null,null,null,null,null,null,null,null,null,{"$f":"IF(_集キーワード!B39=\"\",\"\",_集キーワード!B39)","v":"lancers.jp"},null,null,null,{"$f":"IF(_集キーワード!C39=\"\",\"\",_集キーワード!C39)","v":0},null,null,null,null,null,{"$f":"IF(_console!A25=\"\",\"\",_console!A25)","v":"outlook vba sendkeys"},null,null,null,null,null,null,null,null,null,null,null,{"$f":"IF(_console!B25=\"\",\"\",_console!B25)","v":6},null,{"$f":"IF(_console!C25=\"\",\"\",_console!C25)","v":19},null,{"$f":"IF(_console!D25=\"\",\"\",_console!D25)","v":0.31580000000000003},null,{"$f":"IF(_console!E25=\"\",\"\",_console!E25)","v":10.9}]
[{"$f":"IF(_集キーワード!A40=\"\",\"\",_集キーワード!A40)","v":"(not set)"},null,null,null,null,null,null,null,null,null,null,null,{"$f":"IF(_集キーワード!B40=\"\",\"\",_集キーワード!B40)","v":"m.facebook.com"},null,null,null,{"$f":"IF(_集キーワード!C40=\"\",\"\",_集キーワード!C40)","v":0},null,null,null,null,null,{"$f":"IF(_console!A26=\"\",\"\",_console!A26)","v":"sentonbehalfofname"},null,null,null,null,null,null,null,null,null,null,null,{"$f":"IF(_console!B26=\"\",\"\",_console!B26)","v":6},null,{"$f":"IF(_console!C26=\"\",\"\",_console!C26)","v":148},null,{"$f":"IF(_console!D26=\"\",\"\",_console!D26)","v":4.0500000000000001E-2},null,{"$f":"IF(_console!E26=\"\",\"\",_console!E26)","v":11.3}]
[{"$f":"IF(_集キーワード!A41=\"\",\"\",_集キーワード!A41)","v":"(not set)"},null,null,null,null,null,null,null,null,null,null,null,{"$f":"IF(_集キーワード!B41=\"\",\"\",_集キーワード!B41)","v":"m.youtube.com"},null,null,null,{"$f":"IF(_集キーワード!C41=\"\",\"\",_集キーワード!C41)","v":0},null,null,null,null,null,{"$f":"IF(_console!A27=\"\",\"\",_console!A27)","v":"outlook マクロ 便利"},null,null,null,null,null,null,null,null,null,null,null,{"$f":"IF(_console!B27=\"\",\"\",_console!B27)","v":5},null,{"$f":"IF(_console!C27=\"\",\"\",_console!C27)","v":114},null,{"$f":"IF(_console!D27=\"\",\"\",_console!D27)","v":4.3900000000000002E-2},null,{"$f":"IF(_console!E27=\"\",\"\",_console!E27)","v":20.7}]
[{"$f":"IF(_集キーワード!A42=\"\",\"\",_集キーワード!A42)","v":"(not set)"},null,null,null,null,null,null,null,null,null,null,null,{"$f":"IF(_集キーワード!B42=\"\",\"\",_集キーワード!B42)","v":"mixi.jp"},null,null,null,{"$f":"IF(_集キーワード!C42=\"\",\"\",_集キーワード!C42)","v":0},null,null,null,null,null,{"$f":"IF(_console!A28=\"\",\"\",_console!A28)","v":"putty 日本語版"},null,null,null,null,null,null,null,null,null,null,null,{"$f":"IF(_console!B28=\"\",\"\",_console!B28)","v":5},null,{"$f":"IF(_console!C28=\"\",\"\",_console!C28)","v":74},null,{"$f":"IF(_console!D28=\"\",\"\",_console!D28)","v":6.7599999999999993E-2},null,{"$f":"IF(_console!E28=\"\",\"\",_console!E28)","v":9.9}]
[{"$f":"IF(_集キーワード!A43=\"\",\"\",_集キーワード!A43)","v":"(not set)"},null,null,null,null,null,null,null,null,null,null,null,{"$f":"IF(_集キーワード!B43=\"\",\"\",_集キーワード!B43)","v":"n2ch.net"},null,null,null,{"$f":"IF(_集キーワード!C43=\"\",\"\",_集キーワード!C43)","v":0},null,null,null,null,null,{"$f":"IF(_console!A29=\"\",\"\",_console!A29)","v":"ひかりパーソナルフォン"},null,null,null,null,null,null,null,null,null,null,null,{"$f":"IF(_console!B29=\"\",\"\",_console!B29)","v":5},null,{"$f":"IF(_console!C29=\"\",\"\",_console!C29)","v":159},null,{"$f":"IF(_console!D29=\"\",\"\",_console!D29)","v":3.1399999999999997E-2},null,{"$f":"IF(_console!E29=\"\",\"\",_console!E29)","v":12.1}]
[{"$f":"IF(_集キーワード!A44=\"\",\"\",_集キーワード!A44)","v":"(not set)"},null,null,null,null,null,null,null,null,null,null,null,{"$f":"IF(_集キーワード!B44=\"\",\"\",_集キーワード!B44)","v":"nozomi.2ch.sc"},null,null,null,{"$f":"IF(_集キーワード!C44=\"\",\"\",_集キーワード!C44)","v":0},null,null,null,null,null,{"$f":"IF(_console!A30=\"\",\"\",_console!A30)","v":"リバースパッチ"},null,null,null,null,null,null,null,null,null,null,null,{"$f":"IF(_console!B30=\"\",\"\",_console!B30)","v":5},null,{"$f":"IF(_console!C30=\"\",\"\",_console!C30)","v":206},null,{"$f":"IF(_console!D30=\"\",\"\",_console!D30)","v":2.4299999999999999E-2},null,{"$f":"IF(_console!E30=\"\",\"\",_console!E30)","v":7.8}]
[{"$f":"IF(_集キーワード!A45=\"\",\"\",_集キーワード!A45)","v":"(not set)"},null,null,null,null,null,null,null,null,null,null,null,{"$f":"IF(_集キーワード!B45=\"\",\"\",_集キーワード!B45)","v":"safetyaction.tokyo"},null,null,null,{"$f":"IF(_集キーワード!C45=\"\",\"\",_集キーワード!C45)","v":0},null,null,null,null,null,{"$f":"IF(_console!A31=\"\",\"\",_console!A31)","v":"createobject(\"outlook.application\")"},null,null,null,null,null,null,null,null,null,null,null,{"$f":"IF(_console!B31=\"\",\"\",_console!B31)","v":4},null,{"$f":"IF(_console!C31=\"\",\"\",_console!C31)","v":134},null,{"$f":"IF(_console!D31=\"\",\"\",_console!D31)","v":2.9899999999999999E-2},null,{"$f":"IF(_console!E31=\"\",\"\",_console!E31)","v":10.8}]
[{"$f":"IF(_集キーワード!A46=\"\",\"\",_集キーワード!A46)","v":"(not set)"},null,null,null,null,null,null,null,null,null,null,null,{"$f":"IF(_集キーワード!B46=\"\",\"\",_集キーワード!B46)","v":"t.co"},null,null,null,{"$f":"IF(_集キーワード!C46=\"\",\"\",_集キーワード!C46)","v":0},null,null,null,null,null,{"$f":"IF(_console!A32=\"\",\"\",_console!A32)","v":"dreamweaver smarty"},null,null,null,null,null,null,null,null,null,null,null,{"$f":"IF(_console!B32=\"\",\"\",_console!B32)","v":4},null,{"$f":"IF(_console!C32=\"\",\"\",_console!C32)","v":23},null,{"$f":"IF(_console!D32=\"\",\"\",_console!D32)","v":0.1739},null,{"$f":"IF(_console!E32=\"\",\"\",_console!E32)","v":8.6}]

{"sheet":"集客参照サイト","index":9,"n_rows":33,"n_cols":31,"rows_kept":33,"cut":false,"hidden":false,"merged":[[31,0,31,23],[31,24,31,29],[31,30,31,35],[32,0,32,23],[32,24,32,29],[32,30,32,35],[25,30,25,35],[26,30,26,35],[27,30,27,35],[28,30,28,35],[29,30,29,35],[30,30,30,35],[26,24,26,29],[27,24,27,29],[28,24,28,29],[29,24,29,29],[30,24,30,29],[20,30,20,35],[21,30,21,35],[22,30,22,35],[23,30,23,35],[24,30,24,35],[27,0,27,23],[28,0,28,23],[29,0,29,23],[30,0,30,23],[20,24,20,29],[21,24,21,29],[22,24,22,29],[23,24,23,29],[24,24,24,29],[25,24,25,29],[21,0,21,23],[22,0,22,23],[23,0,23,23],[24,0,24,23],[25,0,25,23],[26,0,26,23],[15,30,15,35],[16,30,16,35],[17,30,17,35],[18,30,18,35],[19,30,19,35],[20,0,20,23],[9,30,9,35],[10,30,10,35],[11,30,11,35],[12,30,12,35],[13,30,13,35],[14,30,14,35],[19,24,19,29],[14,24,14,29],[15,24,15,29],[16,24,16,29],[17,24,17,29],[18,24,18,29],[16,0,16,23],[17,0,17,23],[18,0,18,23],[0,30,0,35],[1,30,1,35],[2,30,2,35],[3,30,3,35],[4,30,4,35],[5,30,5,35],[6,30,6,35],[7,30,7,35],[8,30,8,35],[13,24,13,29],[7,24,7,29],[8,24,8,29],[9,24,9,29],[10,24,10,29],[11,24,11,29],[12,24,12,29],[5,24,5,29],[6,24,6,29],[0,24,0,29],[1,24,1,29],[2,24,2,29],[3,24,3,29],[4,24,4,29],[19,0,19,23],[5,0,5,23],[6,0,6,23],[7,0,7,23],[8,0,8,23],[9,0,9,23],[10,0,10,23],[11,0,11,23],[12,0,12,23],[13,0,13,23],[14,0,14,23],[15,0,15,23],[0,0,0,23],[1,0,1,23],[2,0,2,23],[3,0,3,23],[4,0,4,23]]}
[{"$f":"IF(_集参照サイト!A15=\"\",\"\",_集参照サイト!A15)","v":"Source"},null,null,null,null,null,null,null,null,null,null,null,null,null,null,null,null,null,null,null,null,null,null,null,{"$f":"IF(_ユ推移!B15=\"\",\"\",_ユ推移!B15)","v":"Users"},null,null,null,null,null,"グラフ"]
[{"$f":"IF(_集参照サイト!A16=\"\",\"\",_集参照サイト!A16)","v":"t.co"},null,null,null,null,null,null,null,null,null,null,null,null,null,null,null,null,null,null,null,null,null,null,null,{"$f":"IF(_集参照サイト!B16=\"\",\"\",_集参照サイト!B16)","v":2167},null,null,null,null,null,{"$f":"Y2","v":2167}]
[{"$f":"IF(_集参照サイト!A17=\"\",\"\",_集参照サイト!A17)","v":"asahi.com"},null,null,null,null,null,null,null,null,null,null,null,null,null,null,null,null,null,null,null,null,null,null,null,{"$f":"IF(_集参照サイト!B17=\"\",\"\",_集参照サイト!B17)","v":104},null,null,null,null,null,{"$f":"Y3","v":104}]
[{"$f":"IF(_集参照サイト!A18=\"\",\"\",_集参照サイト!A18)","v":"m.facebook.com"},null,null,null,null,null,null,null,null,null,null,null,null,null,null,null,null,null,null,null,null,null,null,null,{"$f":"IF(_集参照サイト!B18=\"\",\"\",_集参照サイト!B18)","v":60},null,null,null,null,null,60]
[{"$f":"IF(_集参照サイト!A19=\"\",\"\",_集参照サイト!A19)","v":"av.watch.impress.co.jp"},null,null,null,null,null,null,null,null,null,null,null,null,null,null,null,null,null,null,null,null,null,null,null,{"$f":"IF(_集参照サイト!B19=\"\",\"\",_集参照サイト!B19)","v":49},null,null,null,null,null,49]
[{"$f":"IF(_集参照サイト!A20=\"\",\"\",_集参照サイト!A20)","v":"twitter.com"},null,null,null,null,null,null,null,null,null,null,null,null,null,null,null,null,null,null,null,null,null,null,null,{"$f":"IF(_集参照サイト!B20=\"\",\"\",_集参照サイト!B20)","v":26},null,null,null,null,null,26]
[{"$f":"IF(_集参照サイト!A21=\"\",\"\",_集参照サイト!A21)","v":"itest.5ch.net"},null,null,null,null,null,null,null,null,null,null,null,null,null,null,null,null,null,null,null,null,null,null,null,{"$f":"IF(_集参照サイト!B21=\"\",\"\",_集参照サイト!B21)","v":24},null,null,null,null,null,24]
[{"$f":"IF(_集参照サイト!A22=\"\",\"\",_集参照サイト!A22)","v":"youtube.com"},null,null,null,null,null,null,null,null,null,null,null,null,null,null,null,null,null,null,null,null,null,null,null,{"$f":"IF(_集参照サイト!B22=\"\",\"\",_集参照サイト!B22)","v":22},null,null,null,null,null,22]
[{"$f":"IF(_集参照サイト!A23=\"\",\"\",_集参照サイト!A23)","v":"www-asahi-com.cdn.ampproject.org"},null,null,null,null,null,null,null,null,null,null,null,null,null,null,null,null,null,null,null,null,null,null,null,{"$f":"IF(_集参照サイト!B23=\"\",\"\",_集参照サイト!B23)","v":18},null,null,null,null,null,18]
[{"$f":"IF(_集参照サイト!A24=\"\",\"\",_集参照サイト!A24)","v":"facebook.com"},null,null,null,null,null,null,null,null,null,null,null,null,null,null,null,null,null,null,null,null,null,null,null,{"$f":"IF(_集参照サイト!B24=\"\",\"\",_集参照サイト!B24)","v":7},null,null,null,null,null,7]
[{"$f":"IF(_集参照サイト!A25=\"\",\"\",_集参照サイト!A25)","v":"n2ch.net"},null,null,null,null,null,null,null,null,null,null,null,null,null,null,null,null,null,null,null,null,null,null,null,{"$f":"IF(_集参照サイト!B25=\"\",\"\",_集参照サイト!B25)","v":4},null,null,null,null,null,4]
[{"$f":"IF(_集参照サイト!A26=\"\",\"\",_集参照サイト!A26)","v":"cse.google.com"},null,null,null,null,null,null,null,null,null,null,null,null,null,null,null,null,null,null,null,null,null,null,null,{"$f":"IF(_集参照サイト!B26=\"\",\"\",_集参照サイト!B26)","v":3},null,null,null,null,null,3]
[{"$f":"IF(_集参照サイト!A27=\"\",\"\",_集参照サイト!A27)","v":"digital.asahi.com"},null,null,null,null,null,null,null,null,null,null,null,null,null,null,null,null,null,null,null,null,null,null,null,{"$f":"IF(_集参照サイト!B27=\"\",\"\",_集参照サイト!B27)","v":3},null,null,null,null,null,3]
[{"$f":"IF(_集参照サイト!A28=\"\",\"\",_集参照サイト!A28)","v":"lancers.jp"},null,null,null,null,null,null,null,null,null,null,null,null,null,null,null,null,null,null,null,null,null,null,null,{"$f":"IF(_集参照サイト!B28=\"\",\"\",_集参照サイト!B28)","v":3},null,null,null,null,null,3]
[{"$f":"IF(_集参照サイト!A29=\"\",\"\",_集参照サイト!A29)","v":"nozomi.2ch.sc"},null,null,null,null,null,null,null,null,null,null,null,null,null,null,null,null,null,null,null,null,null,null,null,{"$f":"IF(_集参照サイト!B29=\"\",\"\",_集参照サイト!B29)","v":3},null,null,null,null,null,3]
[{"$f":"IF(_集参照サイト!A30=\"\",\"\",_集参照サイト!A30)","v":"download.co.jp"},null,null,null,null,null,null,null,null,null,null,null,null,null,null,null,null,null,null,null,null,null,null,null,{"$f":"IF(_集参照サイト!B30=\"\",\"\",_集参照サイト!B30)","v":2},null,null,null,null,null,2]
[{"$f":"IF(_集参照サイト!A31=\"\",\"\",_集参照サイト!A31)","v":"l.facebook.com"},null,null,null,null,null,null,null,null,null,null,null,null,null,null,null,null,null,null,null,null,null,null,null,{"$f":"IF(_集参照サイト!B31=\"\",\"\",_集参照サイト!B31)","v":2},null,null,null,null,null,2]
[{"$f":"IF(_集参照サイト!A32=\"\",\"\",_集参照サイト!A32)","v":"l.moapi.net"},null,null,null,null,null,null,null,null,null,null,null,null,null,null,null,null,null,null,null,null,null,null,null,{"$f":"IF(_集参照サイト!B32=\"\",\"\",_集参照サイト!B32)","v":2},null,null,null,null,null,2]
[{"$f":"IF(_集参照サイト!A33=\"\",\"\",_集参照サイト!A33)","v":"m.youtube.com"},null,null,null,null,null,null,null,null,null,null,null,null,null,null,null,null,null,null,null,null,null,null,null,{"$f":"IF(_集参照サイト!B33=\"\",\"\",_集参照サイト!B33)","v":2},null,null,null,null,null,2]
[{"$f":"IF(_集参照サイト!A34=\"\",\"\",_集参照サイト!A34)","v":"111.16.100.102"},null,null,null,null,null,null,null,null,null,null,null,null,null,null,null,null,null,null,null,null,null,null,null,{"$f":"IF(_集参照サイト!B34=\"\",\"\",_集参照サイト!B34)","v":1},null,null,null,null,null,1]
[{"$f":"IF(_集参照サイト!A35=\"\",\"\",_集参照サイト!A35)","v":"222.32.0.142:10080"},null,null,null,null,null,null,null,null,null,null,null,null,null,null,null,null,null,null,null,null,null,null,null,{"$f":"IF(_集参照サイト!B35=\"\",\"\",_集参照サイト!B35)","v":1},null,null,null,null,null,1]
[{"$f":"IF(_集参照サイト!A36=\"\",\"\",_集参照サイト!A36)","v":"adwords.corp.google.com"},null,null,null,null,null,null,null,null,null,null,null,null,null,null,null,null,null,null,null,null,null,null,null,{"$f":"IF(_集参照サイト!B36=\"\",\"\",_集参照サイト!B36)","v":1},null,null,null,null,null,1]
[{"$f":"IF(_集参照サイト!A37=\"\",\"\",_集参照サイト!A37)","v":"blog.livedoor.jp"},null,null,null,null,null,null,null,null,null,null,null,null,null,null,null,null,null,null,null,null,null,null,null,{"$f":"IF(_集参照サイト!B37=\"\",\"\",_集参照サイト!B37)","v":1},null,null,null,null,null,1]
[{"$f":"IF(_集参照サイト!A38=\"\",\"\",_集参照サイト!A38)","v":"cse.google.com.ph"},null,null,null,null,null,null,null,null,null,null,null,null,null,null,null,null,null,null,null,null,null,null,null,{"$f":"IF(_集参照サイト!B38=\"\",\"\",_集参照サイト!B38)","v":1},null,null,null,null,null,1]
[{"$f":"IF(_集参照サイト!A39=\"\",\"\",_集参照サイト!A39)","v":"eto.lightning.force.com"},null,null,null,null,null,null,null,null,null,null,null,null,null,null,null,null,null,null,null,null,null,null,null,{"$f":"IF(_集参照サイト!B39=\"\",\"\",_集参照サイト!B39)","v":1},null,null,null,null,null,1]
[{"$f":"IF(_集参照サイト!A40=\"\",\"\",_集参照サイト!A40)","v":"hayabusa3.2ch.sc"},null,null,null,null,null,null,null,null,null,null,null,null,null,null,null,null,null,null,null,null,null,null,null,{"$f":"IF(_集参照サイト!B40=\"\",\"\",_集参照サイト!B40)","v":1},null,null,null,null,null,1]
[{"$f":"IF(_集参照サイト!A41=\"\",\"\",_集参照サイト!A41)","v":"infith.com"},null,null,null,null,null,null,null,null,null,null,null,null,null,null,null,null,null,null,null,null,null,null,null,{"$f":"IF(_集参照サイト!B41=\"\",\"\",_集参照サイト!B41)","v":1},null,null,null,null,null,1]
[{"$f":"IF(_集参照サイト!A42=\"\",\"\",_集参照サイト!A42)","v":"jp.mg5.mail.yahoo.co.jp"},null,null,null,null,null,null,null,null,null,null,null,null,null,null,null,null,null,null,null,null,null,null,null,{"$f":"IF(_集参照サイト!B42=\"\",\"\",_集参照サイト!B42)","v":1},null,null,null,null,null,1]
[{"$f":"IF(_集参照サイト!A43=\"\",\"\",_集参照サイト!A43)","v":"kyodemo.net"},null,null,null,null,null,null,null,null,null,null,null,null,null,null,null,null,null,null,null,null,null,null,null,{"$f":"IF(_集参照サイト!B43=\"\",\"\",_集参照サイト!B43)","v":1},null,null,null,null,null,1]
[{"$f":"IF(_集参照サイト!A44=\"\",\"\",_集参照サイト!A44)","v":"mixi.jp"},null,null,null,null,null,null,null,null,null,null,null,null,null,null,null,null,null,null,null,null,null,null,null,{"$f":"IF(_集参照サイト!B44=\"\",\"\",_集参照サイト!B44)","v":1},null,null,null,null,null,1]
[{"$f":"IF(_集参照サイト!A45=\"\",\"\",_集参照サイト!A45)","v":"t.umblr.com"},null,null,null,null,null,null,null,null,null,null,null,null,null,null,null,null,null,null,null,null,null,null,null,{"$f":"IF(_集参照サイト!B45=\"\",\"\",_集参照サイト!B45)","v":1},null,null,null,null,null,1]
[{"$f":"IF(_集参照サイト!A46=\"\",\"\",_集参照サイト!A46)","v":""},null,null,null,null,null,null,null,null,null,null,null,null,null,null,null,null,null,null,null,null,null,null,null,{"$f":"IF(_集参照サイト!B46=\"\",\"\",_集参照サイト!B46)","v":""},null,null,null,null,null,{"$f":"Y32","v":""}]
[{"$f":"IF(_集参照サイト!A47=\"\",\"\",_集参照サイト!A47)","v":""},null,null,null,null,null,null,null,null,null,null,null,null,null,null,null,null,null,null,null,null,null,null,null,{"$f":"IF(_集参照サイト!B47=\"\",\"\",_集参照サイト!B47)","v":""},null,null,null,null,null,""]

{"sheet":"コンテンツごとのデータ","index":10,"n_rows":32,"n_cols":40,"rows_kept":32,"cut":false,"hidden":false,"merged":[[3,27,3,30],[3,35,3,38],[0,39,0,42],[0,35,0,38],[0,31,0,34],[0,27,0,30],[0,23,0,26],[12,0,12,18],[13,0,13,18],[10,0,10,18],[11,0,11,18],[8,0,8,18],[9,0,9,18],[6,0,6,18],[7,0,7,18],[4,0,4,18],[5,0,5,18],[0,0,0,18],[1,0,1,18],[2,0,2,18],[3,0,3,18],[1,19,1,22],[3,19,3,22],[1,27,1,30],[30,0,30,18],[31,0,31,18],[28,0,28,18],[29,0,29,18],[26,0,26,18],[27,0,27,18],[24,0,24,18],[25,0,25,18],[22,0,22,18],[23,0,23,18],[20,0,20,18],[21,0,21,18],[18,0,18,18],[19,0,19,18],[16,0,16,18],[17,0,17,18],[14,0,14,18],[15,0,15,18],[1,23,1,26],[14,19,14,22],[15,19,15,22],[14,23,14,26],[15,23,15,26],[16,23,16,26],[17,23,17,26],[18,23,18,26],[19,23,19,26],[1,31,1,34],[1,35,1,38],[1,39,1,42],[2,19,2,22],[2,27,2,30],[2,35,2,38],[0,19,0,22],[12,19,12,22],[13,19,13,22],[4,19,4,22],[5,19,5,22],[6,19,6,22],[7,19,7,22],[8,19,8,22],[9,19,9,22],[8,23,8,26],[9,23,9,26],[10,23,10,26],[11,23,11,26],[12,23,12,26],[13,23,13,26],[12,27,12,30],[13,27,13,30],[12,35,12,38],[28,19,28,22],[29,19,29,22],[30,19,30,22],[31,19,31,22],[2,23,2,26],[3,23,3,26],[4,23,4,26],[5,23,5,26],[6,23,6,26],[7,23,7,26],[22,19,22,22],[23,19,23,22],[24,19,24,22],[25,19,25,22],[26,19,26,22],[27,19,27,22],[16,19,16,22],[17,19,17,22],[18,19,18,22],[19,19,19,22],[20,19,20,22],[21,19,21,22],[10,19,10,22],[11,19,11,22],[26,23,26,26],[27,23,27,26],[28,23,28,26],[29,23,29,26],[30,23,30,26],[31,23,31,26],[20,23,20,26],[21,23,21,26],[22,23,22,26],[23,23,23,26],[24,23,24,26],[25,23,25,26],[14,27,14,30],[15,27,15,30],[4,27,4,30],[5,27,5,30],[6,27,6,30],[7,27,7,30],[8,27,8,30],[9,27,9,30],[28,27,28,30],[29,27,29,30],[30,27,30,30],[31,27,31,30],[2,31,2,34],[3,31,3,34],[4,31,4,34],[5,31,5,34],[6,31,6,34],[7,31,7,34],[22,27,22,30],[23,27,23,30],[24,27,24,30],[25,27,25,30],[26,27,26,30],[27,27,27,30],[16,27,16,30],[17,27,17,30],[18,27,18,30],[19,27,19,30],[20,27,20,30],[21,27,21,30],[10,27,10,30],[11,27,11,30],[14,31,14,34],[15,31,15,34],[16,31,16,34],[17,31,17,34],[18,31,18,34],[19,31,19,34],[8,31,8,34],[9,31,9,34],[10,31,10,34],[11,31,11,34],[12,31,12,34],[13,31,13,34],[26,31,26,34],[27,31,27,34],[28,31,28,34],[29,31,29,34],[30,31,30,34],[31,31,31,34],[20,31,20,34],[21,31,21,34],[22,31,22,34],[23,31,23,34],[24,31,24,34],[25,31,25,34],[13,35,13,38],[14,35,14,38],[15,35,15,38],[4,35,4,38],[5,35,5,38],[6,35,6,38],[7,35,7,38],[8,35,8,38],[9,35,9,38],[28,35,28,38],[29,35,29,38],[30,35,30,38],[31,35,31,38],[2,39,2,42],[3,39,3,42],[4,39,4,42],[5,39,5,42],[6,39,6,42],[7,39,7,42],[22,35,22,38],[23,35,23,38],[24,35,24,38],[25,35,25,38],[26,35,26,38],[27,35,27,38],[16,35,16,38],[17,35,17,38],[18,35,18,38],[19,35,19,38],[20,35,20,38],[21,35,21,38],[10,35,10,38],[11,35,11,38],[14,39,14,42],[15,39,15,42],[16,39,16,42],[17,39,17,42],[18,39,18,42],[19,39,19,42],[8,39,8,42],[9,39,9,42],[10,39,10,42],[11,39,11,42],[12,39,12,42],[13,39,13,42],[26,39,26,42],[27,39,27,42],[28,39,28,42],[29,39,29,42],[30,39,30,42],[31,39,31,42],[20,39,20,42],[21,39,21,42],[22,39,22,42],[23,39,23,42],[24,39,24,42],[25,39,25,42]]}
[{"$f":"IF(_行ページ!A15=\"\",\"\",_行ページ!A15)","v":"Page"},null,null,null,null,null,null,null,null,null,null,null,null,null,null,null,null,null,null,{"$f":"IF(_行ページ!B15=\"\",\"\",_行ページ!B15)","v":"Pageviews"},null,null,null,{"$f":"IF(_行ページ!C15=\"\",\"\",_行ページ!C15)","v":"Sessions"},null,null,null,"平均滞在時間",null,null,null,"閲覧開始数",null,null,null,"直帰率",null,null,null,"離脱率"]
[{"$f":"IF(_行ページ!A16=\"\",\"\",_行ページ!A16)","v":"https://www.officeants.com/"},null,null,null,null,null,null,null,null,null,null,null,null,null,null,null,null,null,null,{"$f":"IF(_行ページ!B16=\"\",\"\",_行ページ!B16)","v":18088},null,null,null,{"$f":"IF(_行ページ!C16=\"\",\"\",_行ページ!C16)","v":11695},null,null,null,{"$f":"IF(_行ページ!D16=\"\",\"\",_行ページ!D16)","v":60.476828256489199},null,null,null,{"$f":"IF(_行ページ!E16=\"\",\"\",_行ページ!E16)","v":11695},null,null,null,{"$f":"IF(_行ページ!F16=\"\",\"\",_行ページ!F16)","v":0.69063702436938867},null,null,null,{"$f":"IF(_行ページ!G16=\"\",\"\",_行ページ!G16)","v":0.53355816010614776}]
[{"$f":"IF(_行ページ!A17=\"\",\"\",_行ページ!A17)","v":"https://www.officeants.com/try/"},null,null,null,null,null,null,null,null,null,null,null,null,null,null,null,null,null,null,{"$f":"IF(_行ページ!B17=\"\",\"\",_行ページ!B17)","v":5867},null,null,null,{"$f":"IF(_行ページ!C17=\"\",\"\",_行ページ!C17)","v":188},null,null,null,{"$f":"IF(_行ページ!D17=\"\",\"\",_行ページ!D17)","v":20.076357697019098},null,null,null,{"$f":"IF(_行ページ!E17=\"\",\"\",_行ページ!E17)","v":188},null,null,null,{"$f":"IF(_行ページ!F17=\"\",\"\",_行ページ!F17)","v":0.61702127659574468},null,null,null,{"$f":"IF(_行ページ!G17=\"\",\"\",_行ページ!G17)","v":0.16516107039372763}]
[{"$f":"IF(_行ページ!A18=\"\",\"\",_行ページ!A18)","v":"https://www.officeants.com/event/"},null,null,null,null,null,null,null,null,null,null,null,null,null,null,null,null,null,null,{"$f":"IF(_行ページ!B18=\"\",\"\",_行ページ!B18)","v":2537},null,null,null,{"$f":"IF(_行ページ!C18=\"\",\"\",_行ページ!C18)","v":731},null,null,null,{"$f":"IF(_行ページ!D18=\"\",\"\",_行ページ!D18)","v":115.338473400154},null,null,null,{"$f":"IF(_行ページ!E18=\"\",\"\",_行ページ!E18)","v":731},null,null,null,{"$f":"IF(_行ページ!F18=\"\",\"\",_行ページ!F18)","v":0.68946648426812585},null,null,null,{"$f":"IF(_行ページ!G18=\"\",\"\",_行ページ!G18)","v":0.48876625936145052}]
[{"$f":"IF(_行ページ!A19=\"\",\"\",_行ページ!A19)","v":"https://www.officeants.com/try/5.php"},null,null,null,null,null,null,null,null,null,null,null,null,null,null,null,null,null,null,{"$f":"IF(_行ページ!B19=\"\",\"\",_行ページ!B19)","v":1094},null,null,null,{"$f":"IF(_行ページ!C19=\"\",\"\",_行ページ!C19)","v":20},null,null,null,{"$f":"IF(_行ページ!D19=\"\",\"\",_行ページ!D19)","v":45.619419642857103},null,null,null,{"$f":"IF(_行ページ!E19=\"\",\"\",_行ページ!E19)","v":20},null,null,null,{"$f":"IF(_行ページ!F19=\"\",\"\",_行ページ!F19)","v":0.55000000000000004},null,null,null,{"$f":"IF(_行ページ!G19=\"\",\"\",_行ページ!G19)","v":0.18098720292504569}]
[{"$f":"IF(_行ページ!A20=\"\",\"\",_行ページ!A20)","v":"https://www.officeants.com/try/3.php"},null,null,null,null,null,null,null,null,null,null,null,null,null,null,null,null,null,null,{"$f":"IF(_行ページ!B20=\"\",\"\",_行ページ!B20)","v":874},null,null,null,{"$f":"IF(_行ページ!C20=\"\",\"\",_行ページ!C20)","v":13},null,null,null,{"$f":"IF(_行ページ!D20=\"\",\"\",_行ページ!D20)","v":38.187002652519801},null,null,null,{"$f":"IF(_行ページ!E20=\"\",\"\",_行ページ!E20)","v":13},null,null,null,{"$f":"IF(_行ページ!F20=\"\",\"\",_行ページ!F20)","v":0.69230769230769229},null,null,null,{"$f":"IF(_行ページ!G20=\"\",\"\",_行ページ!G20)","v":0.13729977116704806}]
[{"$f":"IF(_行ページ!A21=\"\",\"\",_行ページ!A21)","v":"https://www.officeants.com/try/4.php"},null,null,null,null,null,null,null,null,null,null,null,null,null,null,null,null,null,null,{"$f":"IF(_行ページ!B21=\"\",\"\",_行ページ!B21)","v":695},null,null,null,{"$f":"IF(_行ページ!C21=\"\",\"\",_行ページ!C21)","v":10},null,null,null,{"$f":"IF(_行ページ!D21=\"\",\"\",_行ページ!D21)","v":34.882258064516101},null,null,null,{"$f":"IF(_行ページ!E21=\"\",\"\",_行ページ!E21)","v":10},null,null,null,{"$f":"IF(_行ページ!F21=\"\",\"\",_行ページ!F21)","v":1},null,null,null,{"$f":"IF(_行ページ!G21=\"\",\"\",_行ページ!G21)","v":0.10791366906474821}]
[{"$f":"IF(_行ページ!A22=\"\",\"\",_行ページ!A22)","v":"https://www.officeants.com/try/2.php"},null,null,null,null,null,null,null,null,null,null,null,null,null,null,null,null,null,null,{"$f":"IF(_行ページ!B22=\"\",\"\",_行ページ!B22)","v":664},null,null,null,{"$f":"IF(_行ページ!C22=\"\",\"\",_行ページ!C22)","v":12},null,null,null,{"$f":"IF(_行ページ!D22=\"\",\"\",_行ページ!D22)","v":45.981878088962098},null,null,null,{"$f":"IF(_行ページ!E22=\"\",\"\",_行ページ!E22)","v":12},null,null,null,{"$f":"IF(_行ページ!F22=\"\",\"\",_行ページ!F22)","v":0.58333333333333337},null,null,null,{"$f":"IF(_行ページ!G22=\"\",\"\",_行ページ!G22)","v":8.5843373493975902E-2}]
[{"$f":"IF(_行ページ!A23=\"\",\"\",_行ページ!A23)","v":"https://www.officeants.com/try/1.php"},null,null,null,null,null,null,null,null,null,null,null,null,null,null,null,null,null,null,{"$f":"IF(_行ページ!B23=\"\",\"\",_行ページ!B23)","v":610},null,null,null,{"$f":"IF(_行ページ!C23=\"\",\"\",_行ページ!C23)","v":17},null,null,null,{"$f":"IF(_行ページ!D23=\"\",\"\",_行ページ!D23)","v":41.695121951219498},null,null,null,{"$f":"IF(_行ページ!E23=\"\",\"\",_行ページ!E23)","v":17},null,null,null,{"$f":"IF(_行ページ!F23=\"\",\"\",_行ページ!F23)","v":0.82352941176470584},null,null,null,{"$f":"IF(_行ページ!G23=\"\",\"\",_行ページ!G23)","v":0.19344262295081968}]
[{"$f":"IF(_行ページ!A24=\"\",\"\",_行ページ!A24)","v":"https://www.officeants.com/pipo/3.php"},null,null,null,null,null,null,null,null,null,null,null,null,null,null,null,null,null,null,{"$f":"IF(_行ページ!B24=\"\",\"\",_行ページ!B24)","v":450},null,null,null,{"$f":"IF(_行ページ!C24=\"\",\"\",_行ページ!C24)","v":191},null,null,null,{"$f":"IF(_行ページ!D24=\"\",\"\",_行ページ!D24)","v":44.034482758620598},null,null,null,{"$f":"IF(_行ページ!E24=\"\",\"\",_行ページ!E24)","v":191},null,null,null,{"$f":"IF(_行ページ!F24=\"\",\"\",_行ページ!F24)","v":0.53403141361256545},null,null,null,{"$f":"IF(_行ページ!G24=\"\",\"\",_行ページ!G24)","v":0.35555555555555557}]
[{"$f":"IF(_行ページ!A25=\"\",\"\",_行ページ!A25)","v":"https://www.officeants.com/game/"},null,null,null,null,null,null,null,null,null,null,null,null,null,null,null,null,null,null,{"$f":"IF(_行ページ!B25=\"\",\"\",_行ページ!B25)","v":340},null,null,null,{"$f":"IF(_行ページ!C25=\"\",\"\",_行ページ!C25)","v":26},null,null,null,{"$f":"IF(_行ページ!D25=\"\",\"\",_行ページ!D25)","v":163.96585365853599},null,null,null,{"$f":"IF(_行ページ!E25=\"\",\"\",_行ページ!E25)","v":26},null,null,null,{"$f":"IF(_行ページ!F25=\"\",\"\",_行ページ!F25)","v":0.73076923076923062},null,null,null,{"$f":"IF(_行ページ!G25=\"\",\"\",_行ページ!G25)","v":0.39705882352941174}]
[{"$f":"IF(_行ページ!A26=\"\",\"\",_行ページ!A26)","v":"https://www.officeants.com/pipo/2.php"},null,null,null,null,null,null,null,null,null,null,null,null,null,null,null,null,null,null,{"$f":"IF(_行ページ!B26=\"\",\"\",_行ページ!B26)","v":280},null,null,null,{"$f":"IF(_行ページ!C26=\"\",\"\",_行ページ!C26)","v":7},null,null,null,{"$f":"IF(_行ページ!D26=\"\",\"\",_行ページ!D26)","v":12.3524590163934},null,null,null,{"$f":"IF(_行ページ!E26=\"\",\"\",_行ページ!E26)","v":7},null,null,null,{"$f":"IF(_行ページ!F26=\"\",\"\",_行ページ!F26)","v":0.8571428571428571},null,null,null,{"$f":"IF(_行ページ!G26=\"\",\"\",_行ページ!G26)","v":0.12857142857142856}]
[{"$f":"IF(_行ページ!A27=\"\",\"\",_行ページ!A27)","v":"https://www.officeants.com/pipo/"},null,null,null,null,null,null,null,null,null,null,null,null,null,null,null,null,null,null,{"$f":"IF(_行ページ!B27=\"\",\"\",_行ページ!B27)","v":262},null,null,null,{"$f":"IF(_行ページ!C27=\"\",\"\",_行ページ!C27)","v":3},null,null,null,{"$f":"IF(_行ページ!D27=\"\",\"\",_行ページ!D27)","v":15.1737288135593},null,null,null,{"$f":"IF(_行ページ!E27=\"\",\"\",_行ページ!E27)","v":3},null,null,null,{"$f":"IF(_行ページ!F27=\"\",\"\",_行ページ!F27)","v":0.33333333333333326},null,null,null,{"$f":"IF(_行ページ!G27=\"\",\"\",_行ページ!G27)","v":9.9236641221374045E-2}]
[{"$f":"IF(_行ページ!A28=\"\",\"\",_行ページ!A28)","v":"https://www.officeants.com/queenstars/"},null,null,null,null,null,null,null,null,null,null,null,null,null,null,null,null,null,null,{"$f":"IF(_行ページ!B28=\"\",\"\",_行ページ!B28)","v":221},null,null,null,{"$f":"IF(_行ページ!C28=\"\",\"\",_行ページ!C28)","v":7},null,null,null,{"$f":"IF(_行ページ!D28=\"\",\"\",_行ページ!D28)","v":98.946107784431106},null,null,null,{"$f":"IF(_行ページ!E28=\"\",\"\",_行ページ!E28)","v":7},null,null,null,{"$f":"IF(_行ページ!F28=\"\",\"\",_行ページ!F28)","v":0.42857142857142855},null,null,null,{"$f":"IF(_行ページ!G28=\"\",\"\",_行ページ!G28)","v":0.24434389140271492}]
[{"$f":"IF(_行ページ!A29=\"\",\"\",_行ページ!A29)","v":"https://www.officeants.com/cm/"},null,null,null,null,null,null,null,null,null,null,null,null,null,null,null,null,null,null,{"$f":"IF(_行ページ!B29=\"\",\"\",_行ページ!B29)","v":197},null,null,null,{"$f":"IF(_行ページ!C29=\"\",\"\",_行ページ!C29)","v":6},null,null,null,{"$f":"IF(_行ページ!D29=\"\",\"\",_行ページ!D29)","v":105.615384615384},null,null,null,{"$f":"IF(_行ページ!E29=\"\",\"\",_行ページ!E29)","v":6},null,null,null,{"$f":"IF(_行ページ!F29=\"\",\"\",_行ページ!F29)","v":0.83333333333333348},null,null,null,{"$f":"IF(_行ページ!G29=\"\",\"\",_行ページ!G29)","v":0.27411167512690354}]
[{"$f":"IF(_行ページ!A30=\"\",\"\",_行ページ!A30)","v":"https://www.officeants.com/pipo/1.php"},null,null,null,null,null,null,null,null,null,null,null,null,null,null,null,null,null,null,{"$f":"IF(_行ページ!B30=\"\",\"\",_行ページ!B30)","v":188},null,null,null,{"$f":"IF(_行ページ!C30=\"\",\"\",_行ページ!C30)","v":1},null,null,null,{"$f":"IF(_行ページ!D30=\"\",\"\",_行ページ!D30)","v":47.1666666666666},null,null,null,{"$f":"IF(_行ページ!E30=\"\",\"\",_行ページ!E30)","v":1},null,null,null,{"$f":"IF(_行ページ!F30=\"\",\"\",_行ページ!F30)","v":0},null,null,null,{"$f":"IF(_行ページ!G30=\"\",\"\",_行ページ!G30)","v":0.20212765957446804}]
[{"$f":"IF(_行ページ!A31=\"\",\"\",_行ページ!A31)","v":"https://infith.com/formtest/research/index.php"},null,null,null,null,null,null,null,null,null,null,null,null,null,null,null,null,null,null,{"$f":"IF(_行ページ!B31=\"\",\"\",_行ページ!B31)","v":8},null,null,null,{"$f":"IF(_行ページ!C31=\"\",\"\",_行ページ!C31)","v":1},null,null,null,{"$f":"IF(_行ページ!D31=\"\",\"\",_行ページ!D31)","v":89.75},null,null,null,{"$f":"IF(_行ページ!E31=\"\",\"\",_行ページ!E31)","v":1},null,null,null,{"$f":"IF(_行ページ!F31=\"\",\"\",_行ページ!F31)","v":0},null,null,null,{"$f":"IF(_行ページ!G31=\"\",\"\",_行ページ!G31)","v":0}]
[{"$f":"IF(_行ページ!A32=\"\",\"\",_行ページ!A32)","v":"https://www.officeants.com/?fbclid=IwAR1T-5hYKmn7pX7e4LUL7HO4pu2YxMxHKmsPKrszrtWZJQD1y17gKm2qPHk"},null,null,null,null,null,null,null,null,null,null,null,null,null,null,null,null,null,null,{"$f":"IF(_行ページ!B32=\"\",\"\",_行ページ!B32)","v":7},null,null,null,{"$f":"IF(_行ページ!C32=\"\",\"\",_行ページ!C32)","v":6},null,null,null,{"$f":"IF(_行ページ!D32=\"\",\"\",_行ページ!D32)","v":48},null,null,null,{"$f":"IF(_行ページ!E32=\"\",\"\",_行ページ!E32)","v":6},null,null,null,{"$f":"IF(_行ページ!F32=\"\",\"\",_行ページ!F32)","v":0.66666666666666652},null,null,null,{"$f":"IF(_行ページ!G32=\"\",\"\",_行ページ!G32)","v":0.7142857142857143}]
[{"$f":"IF(_行ページ!A33=\"\",\"\",_行ページ!A33)","v":"https://www.officeants.com.googleweblight.com/"},null,null,null,null,null,null,null,null,null,null,null,null,null,null,null,null,null,null,{"$f":"IF(_行ページ!B33=\"\",\"\",_行ページ!B33)","v":5},null,null,null,{"$f":"IF(_行ページ!C33=\"\",\"\",_行ページ!C33)","v":2},null,null,null,{"$f":"IF(_行ページ!D33=\"\",\"\",_行ページ!D33)","v":6.3333333333333304},null,null,null,{"$f":"IF(_行ページ!E33=\"\",\"\",_行ページ!E33)","v":2},null,null,null,{"$f":"IF(_行ページ!F33=\"\",\"\",_行ページ!F33)","v":0},null,null,null,{"$f":"IF(_行ページ!G33=\"\",\"\",_行ページ!G33)","v":0.4}]
[{"$f":"IF(_行ページ!A34=\"\",\"\",_行ページ!A34)","v":"https://www.officeants.com.googleweblight.com/event/"},null,null,null,null,null,null,null,null,null,null,null,null,null,null,null,null,null,null,{"$f":"IF(_行ページ!B34=\"\",\"\",_行ページ!B34)","v":2},null,null,null,{"$f":"IF(_行ページ!C34=\"\",\"\",_行ページ!C34)","v":0},null,null,null,{"$f":"IF(_行ページ!D34=\"\",\"\",_行ページ!D34)","v":10.5},null,null,null,{"$f":"IF(_行ページ!E34=\"\",\"\",_行ページ!E34)","v":0},null,null,null,{"$f":"IF(_行ページ!F34=\"\",\"\",_行ページ!F34)","v":0},null,null,null,{"$f":"IF(_行ページ!G34=\"\",\"\",_行ページ!G34)","v":0}]
[{"$f":"IF(_行ページ!A35=\"\",\"\",_行ページ!A35)","v":"https://www.officeants.com/try/1.php?fbclid=IwAR05ndgxdTRPR1WbsPXwcKSFy2BBFAmQRLi1RQ1g7aBLAwD_UAxpHfrJW0g"},null,null,null,null,null,null,null,null,null,null,null,null,null,null,null,null,null,null,{"$f":"IF(_行ページ!B35=\"\",\"\",_行ページ!B35)","v":2},null,null,null,{"$f":"IF(_行ページ!C35=\"\",\"\",_行ページ!C35)","v":1},null,null,null,{"$f":"IF(_行ページ!D35=\"\",\"\",_行ページ!D35)","v":115.5},null,null,null,{"$f":"IF(_行ページ!E35=\"\",\"\",_行ページ!E35)","v":1},null,null,null,{"$f":"IF(_行ページ!F35=\"\",\"\",_行ページ!F35)","v":0},null,null,null,{"$f":"IF(_行ページ!G35=\"\",\"\",_行ページ!G35)","v":0}]
[{"$f":"IF(_行ページ!A36=\"\",\"\",_行ページ!A36)","v":"https://www.officeants.com/try/1.php?fbclid=IwAR3k7uYDVVR2GT1JI8zmmre3uBgjhhfwD9kAuDd39sA-0BkZeT3D3QZDM4Y"},null,null,null,null,null,null,null,null,null,null,null,null,null,null,null,null,null,null,{"$f":"IF(_行ページ!B36=\"\",\"\",_行ページ!B36)","v":2},null,null,null,{"$f":"IF(_行ページ!C36=\"\",\"\",_行ページ!C36)","v":1},null,null,null,{"$f":"IF(_行ページ!D36=\"\",\"\",_行ページ!D36)","v":17},null,null,null,{"$f":"IF(_行ページ!E36=\"\",\"\",_行ページ!E36)","v":1},null,null,null,{"$f":"IF(_行ページ!F36=\"\",\"\",_行ページ!F36)","v":0},null,null,null,{"$f":"IF(_行ページ!G36=\"\",\"\",_行ページ!G36)","v":0}]
[{"$f":"IF(_行ページ!A37=\"\",\"\",_行ページ!A37)","v":"https://www.officeants.com.googleweblight.com/pipo/"},null,null,null,null,null,null,null,null,null,null,null,null,null,null,null,null,null,null,{"$f":"IF(_行ページ!B37=\"\",\"\",_行ページ!B37)","v":1},null,null,null,{"$f":"IF(_行ページ!C37=\"\",\"\",_行ページ!C37)","v":0},null,null,null,{"$f":"IF(_行ページ!D37=\"\",\"\",_行ページ!D37)","v":6},null,null,null,{"$f":"IF(_行ページ!E37=\"\",\"\",_行ページ!E37)","v":0},null,null,null,{"$f":"IF(_行ページ!F37=\"\",\"\",_行ページ!F37)","v":0},null,null,null,{"$f":"IF(_行ページ!G37=\"\",\"\",_行ページ!G37)","v":0}]
[{"$f":"IF(_行ページ!A38=\"\",\"\",_行ページ!A38)","v":"https://www.officeants.com/?fbclid=IwAR0r-GqwQDNfYutbpkDBfzxBrVA0oaRwigHZF7BzIaPtathRx0rSHmF1Am0"},null,null,null,null,null,null,null,null,null,null,null,null,null,null,null,null,null,null,{"$f":"IF(_行ページ!B38=\"\",\"\",_行ページ!B38)","v":1},null,null,null,{"$f":"IF(_行ページ!C38=\"\",\"\",_行ページ!C38)","v":1},null,null,null,{"$f":"IF(_行ページ!D38=\"\",\"\",_行ページ!D38)","v":0},null,null,null,{"$f":"IF(_行ページ!E38=\"\",\"\",_行ページ!E38)","v":1},null,null,null,{"$f":"IF(_行ページ!F38=\"\",\"\",_行ページ!F38)","v":1},null,null,null,{"$f":"IF(_行ページ!G38=\"\",\"\",_行ページ!G38)","v":1}]
[{"$f":"IF(_行ページ!A39=\"\",\"\",_行ページ!A39)","v":"https://www.officeants.com/?fbclid=IwAR2oNuzHtekWkscFE_pqcFYLq6msY4j6ypgepYqBTLrmO2UK-h087f3Gl_4"},null,null,null,null,null,null,null,null,null,null,null,null,null,null,null,null,null,null,{"$f":"IF(_行ページ!B39=\"\",\"\",_行ページ!B39)","v":1},null,null,null,{"$f":"IF(_行ページ!C39=\"\",\"\",_行ページ!C39)","v":1},null,null,null,{"$f":"IF(_行ページ!D39=\"\",\"\",_行ページ!D39)","v":26},null,null,null,{"$f":"IF(_行ページ!E39=\"\",\"\",_行ページ!E39)","v":1},null,null,null,{"$f":"IF(_行ページ!F39=\"\",\"\",_行ページ!F39)","v":0},null,null,null,{"$f":"IF(_行ページ!G39=\"\",\"\",_行ページ!G39)","v":0}]
[{"$f":"IF(_行ページ!A40=\"\",\"\",_行ページ!A40)","v":"https://www.officeants.com/?nx=146&ny=25&clkt=18&bg=!pKelp79EfItg73rA6mECAAAAklIAAAAwmQGMOSOI79eMVpEuw4EaDMDMXwJZavP0CusogkWKJ1RcBaQU3i-YrsG0OM5--6cg1uBytDxFCEnpElQI6GA_PsTqsxLHQtExwXj3diozTv-b8cShMWTR1r_ZWB7zp9T7ytETfNJyUMgDzH4qENNFSV_nNjgZOYyGr18J2z-Sx-iJUq-3J0dWjxIX9_b8Ki5WMnCpMyxy8fJpMJ0plOYFpst4vnT1ybEXCKIr1UfoQ58dT6426AhW2CY0AtZug406E-OiExlA_nNySBLamaOw8I_fgW0vBHI_PTeTmgoItijbxY4k9Em9cU6qjMZVaHVVYUc57f_SoJtfLjDPdFg_prC7SWlhYprHk0NhamX_NVwOq9CaSHxRB6clLn09gX3eGbcK5Vf4gFa28exmJWSPApI3n4KnJBE93t-7cFgxFjI6FYjDNpCWIV6L5ADXsSX6ceKcgqeLph-p-L_SQ-ZMzPuan2gbU2PlSDvKN60TOarp5ZtN_uyvSOoPok_SjnW4dqmhljWr2C2iChiYtKE-"},null,null,null,null,null,null,null,null,null,null,null,null,null,null,null,null,null,null,{"$f":"IF(_行ページ!B40=\"\",\"\",_行ページ!B40)","v":1},null,null,null,{"$f":"IF(_行ページ!C40=\"\",\"\",_行ページ!C40)","v":1},null,null,null,{"$f":"IF(_行ページ!D40=\"\",\"\",_行ページ!D40)","v":0},null,null,null,{"$f":"IF(_行ページ!E40=\"\",\"\",_行ページ!E40)","v":1},null,null,null,{"$f":"IF(_行ページ!F40=\"\",\"\",_行ページ!F40)","v":1},null,null,null,{"$f":"IF(_行ページ!G40=\"\",\"\",_行ページ!G40)","v":1}]
[{"$f":"IF(_行ページ!A41=\"\",\"\",_行ページ!A41)","v":"https://www.officeants.com/?nx=155&ny=20&clkt=6&bg=!enmleWFEgC7U8g7uBn4CAAAAV1IAAAAbmQF87QywD_lHSJEtYqcWFWz6VGKhJyVeTD6okldjxzBVvS2P1Z9F-KYlIlTpaD3GQNIvTG5Atuh8smWWR3W429MSlv57Xn4PXbeqVHt_BhQqQXoUAb-qDaXjrc_qh5dKam80fC772xGfwMOkZeewZNfDwOkqF4_vqqF_nHs0ZVHoFmbrHDVRf5MHfQi7LndR5pIffSJQO_-qFcRU5QD4EF3l3u59vYOCtkOb6iYzxoaOsy4XsFbxf-ue1LurY1W9K2VOHUETlQIOZCUKWloIVB-D9FTzUpyKUtzXKWHMAYACCXmQyL3R9uBJ11LkQEC9DOlQULexawZpaxEl85k359qUJFedTwK93MUdtcIlB_PR_CIfgfZ_3_bkpxVxSYRVcqKNFcAtdZF8QsUK3kEZSpMZLQfRPP88dh0HAbLaYi0fkV-NCf83gATboh6__Szq8oXwrM4nXOsPwPJPSG205zJXhQkcg5DRM1VilBC9mGL-Kmjj2g6rh-Cri7JDX5c"},null,null,null,null,null,null,null,null,null,null,null,null,null,null,null,null,null,null,{"$f":"IF(_行ページ!B41=\"\",\"\",_行ページ!B41)","v":1},null,null,null,{"$f":"IF(_行ページ!C41=\"\",\"\",_行ページ!C41)","v":1},null,null,null,{"$f":"IF(_行ページ!D41=\"\",\"\",_行ページ!D41)","v":0},null,null,null,{"$f":"IF(_行ページ!E41=\"\",\"\",_行ページ!E41)","v":1},null,null,null,{"$f":"IF(_行ページ!F41=\"\",\"\",_行ページ!F41)","v":1},null,null,null,{"$f":"IF(_行ページ!G41=\"\",\"\",_行ページ!G41)","v":1}]
[{"$f":"IF(_行ページ!A42=\"\",\"\",_行ページ!A42)","v":"https://www.officeants.com/?nx=166&ny=37&clkt=17&bg=!5uWl5f1EjTyNzw1RBssCAAAAolIAAAA1mQF8Jxfq9R_q4CqcwIaL3HK1FuCNLM5hwHXZNLd5haJPjtBxyJniufyi1YpvUaVRtw2T-gRaNw60Rm_IpKU17du_1bWbhN91CCutGjSfd8z3cSzEunIJUimXs1FyzqfjHUWqoNZcOrganhE63PtsYFtZnzcn8HMlqWbXWJCw8yHBpgpf8uX2BNP3UuVOMTpw7cKhm7wJxJOr_pyeEdbhN4LB3kClrmVjQZ1q3giEcGeGaAUmi8C0Z_1DYdgGPPdrpmS1xkVOuxBv64VvMQs4bYlUu6uS_T9V80Cwt2DZsZgsQhmlI_Wwl24xclanHdrDxtxriDMb4O9dOyltFyYRQ4QdIqDhT7T-3ABqVYQZcTY_wxK_Li8SwBiBQuGlWOUg-EpgsyxIPCM4V-GLBAVaB-pBa16U1d5F53rrWC0yVwpK4WRoZ0foz1qbnNRGmiNgzDvG7tnYNO2bxWYQ3_V_1IWaBqTmOjKXLGMRV174Qn1NexIKwy6qsIhRcWHZe00"},null,null,null,null,null,null,null,null,null,null,null,null,null,null,null,null,null,null,{"$f":"IF(_行ページ!B42=\"\",\"\",_行ページ!B42)","v":1},null,null,null,{"$f":"IF(_行ページ!C42=\"\",\"\",_行ページ!C42)","v":1},null,null,null,{"$f":"IF(_行ページ!D42=\"\",\"\",_行ページ!D42)","v":0},null,null,null,{"$f":"IF(_行ページ!E42=\"\",\"\",_行ページ!E42)","v":1},null,null,null,{"$f":"IF(_行ページ!F42=\"\",\"\",_行ページ!F42)","v":1},null,null,null,{"$f":"IF(_行ページ!G42=\"\",\"\",_行ページ!G42)","v":1}]
[{"$f":"IF(_行ページ!A43=\"\",\"\",_行ページ!A43)","v":"https://www.officeants.com/?nx=218&ny=34&clkt=5&bg=!3t2l3cVEesG_1F6p1aQCAAAAU1IAAAAVmQGMA2hsPvtTmCyxDybBZEhaZ9h4yL8FSWBYCxtmN4Ffw5M61oD-sX__6xmoFMuZLXy94p5333y0uxK0PTZlDy6y9UC-YguB6-5JqZ9-VqB0CEyHFz2ysnzgJGMElDHooWdgTJZsIarq0IEGqQW-q-IuxZJAhenwFja-vojJpBegHekNQKAf72f5knNGuNnkSkWPZ5KfKe2_BZO2H97uyWQZ1-CIeQK-QI9KrF1YxxtZlv7r_t4YVfo1BbejIr8Z3Xfil3LIwUi0zU-kilnhhj9-fTedDctPamsemgd-JSOznOg5v62HmJClBdaWxcqaAUpdFtRLbzrVDAS1nAC8uqol5wuF-oUgyTLTgozGCJ3pM4x7bZfaaNq7qGpI4No8RrsZLnLkRlGtll0OStnGHc0fIDK4GGQceUCq3-ohsiuEGlPAflYxtNJ5wHV6kvYjuJU7mqhfYeTOVmD2voYfaR6CDD1YsZjey4mYZAQYBEhATycI9DdFAE6v-VyDCv2f7NMIl_ZD34zLTZOmL2e-"},null,null,null,null,null,null,null,null,null,null,null,null,null,null,null,null,null,null,{"$f":"IF(_行ページ!B43=\"\",\"\",_行ページ!B43)","v":1},null,null,null,{"$f":"IF(_行ページ!C43=\"\",\"\",_行ページ!C43)","v":1},null,null,null,{"$f":"IF(_行ページ!D43=\"\",\"\",_行ページ!D43)","v":0},null,null,null,{"$f":"IF(_行ページ!E43=\"\",\"\",_行ページ!E43)","v":1},null,null,null,{"$f":"IF(_行ページ!F43=\"\",\"\",_行ページ!F43)","v":1},null,null,null,{"$f":"IF(_行ページ!G43=\"\",\"\",_行ページ!G43)","v":1}]
[{"$f":"IF(_行ページ!A44=\"\",\"\",_行ページ!A44)","v":"https://www.officeants.com/?nx=249&ny=33&clkt=12&bg=!lpWllY1Em456ZSqln4wCAAAAnFIAAAA0mQF81b7xadixYoI4ajJuD5fqUkXyTN2XW3LxyZKWyN8oG4Fy0QrbF7fp-hC0yG8c5DZRL40ZgfzD8_hytjhODqOin9aYMsUFbeJI7scGGhHkvtSVuOloYLg-eAWyw4A6-C5YPgJJQ1jVTKapCynEzbs7k-FdCr3bskut-LCx5MyexLxdtavFvcCBjWvlUJWxGERRoTRDv7Uhnhg2qYk7MGE9ST91CJcz3bBGhv-BtT3BfKy283zZqnqk9olFUtxr80RHqGIiI7Nq8eroWqi_e4SDN44eIV_j6iyNRuc3So2VfVfACOQ3FuHPf_C20_CHvEt89xgoo3h5cpMEksGcWPiIOBGPEN3Z7oKv0wdiu_Touw8auVGQYI6dEuAKfh1bTXv0oC1Sonu-IKVnlDwWLaToBANWjMF7VZwNDh6dX4y77bqiwmU59YAky3Ikl6N2DUTXGAz5r8Bf5I5-pEKVIE1Va8Uy1A8pMNEp84EhG9tyAJRANhYX6Ki8fIL5sTs"},null,null,null,null,null,null,null,null,null,null,null,null,null,null,null,null,null,null,{"$f":"IF(_行ページ!B44=\"\",\"\",_行ページ!B44)","v":1},null,null,null,{"$f":"IF(_行ページ!C44=\"\",\"\",_行ページ!C44)","v":1},null,null,null,{"$f":"IF(_行ページ!D44=\"\",\"\",_行ページ!D44)","v":0},null,null,null,{"$f":"IF(_行ページ!E44=\"\",\"\",_行ページ!E44)","v":1},null,null,null,{"$f":"IF(_行ページ!F44=\"\",\"\",_行ページ!F44)","v":1},null,null,null,{"$f":"IF(_行ページ!G44=\"\",\"\",_行ページ!G44)","v":1}]
[{"$f":"IF(_行ページ!A45=\"\",\"\",_行ページ!A45)","v":"https://www.officeants.com/?nx=265&ny=37&clkt=14&bg=!KSqlKjJEwsGQAMjZxqICAAAAk1IAAAA4mQF8sahCTSfQVGLr_mxG-G3RF-CWn1C2CPUmnbYF1YtmrWdeE_PZoLDhpjNHBJbNSIkQ2HflDKazpqQefHgujSIB_nXn1ecmUM_t9lySKMCy3-fw5P2mYRV1y_Npp5DW2l5I3T6r_yms3w2kKNwjJr-VG4WGgoAfILMerdos4sLw8KPyz8dr0NBIE9Frn4hK_QHMqXBP5FiCGfZ4vp7ULovlkiGQBxJSWjShEdtwiMmNGsiDdYvdyPZ_SeBgYYI3WaVot0a11SxX2nKSoXEZoAfcVv-0G6EfiCJhjqEGJ5nofbOvLjcsQQRFjrpR7Q8FEWuTnRnGF9gFGn3klVi8R2qWraxBQ_qb-3JpD2JURdMh2m0cRqNgXe4zCjJMgDV9IgeZ7hJX4ym57O8revDwr2D0fQZO9yDF19sBQv9bsGGFmBVh6t63nFg3NPFAKcPxOWPmFmF1X26mEcwkiVaExE6uxGW3YQknW0056LsnJFzJHtRArSmzrcx21L-4DCo"},null,null,null,null,null,null,null,null,null,null,null,null,null,null,null,null,null,null,{"$f":"IF(_行ページ!B45=\"\",\"\",_行ページ!B45)","v":1},null,null,null,{"$f":"IF(_行ページ!C45=\"\",\"\",_行ページ!C45)","v":1},null,null,null,{"$f":"IF(_行ページ!D45=\"\",\"\",_行ページ!D45)","v":0},null,null,null,{"$f":"IF(_行ページ!E45=\"\",\"\",_行ページ!E45)","v":1},null,null,null,{"$f":"IF(_行ページ!F45=\"\",\"\",_行ページ!F45)","v":1},null,null,null,{"$f":"IF(_行ページ!G45=\"\",\"\",_行ページ!G45)","v":1}]
[{"$f":"IF(_行ページ!A46=\"\",\"\",_行ページ!A46)","v":"https://www.officeants.com/?nx=272&ny=3&clkt=18&bg=!wcKlwtpEP2r2bV4Ze1ICAAAAilIAAABKmQGMd74eW2LcAvTUgw_OwOy-ZyVw__t5_hYCgazEiADrlw2w2nPlmb4VYKRaR4jdT9NpQGzU0OpvtzivJCPb8Ml4mt2zSHrMRYL7JXse2j5W0yWYrf6KTPgpAdsgrfMhCCe6UT8B1MSAXnEH4eAjAQrPOOaRd3Xhb2KEcU-fnNkR0P9bU9gxEsrNDJLTHpG42YZXj3wpTRPlygAzcsN4UKsgnNzLLPl1REfISG2c6lvyWR_e5GbZCCerAsoClSKQX3qh7XvX08d5h5JuWiIJ7o8lKNQcIBEF2LcObctrgTNOVPvtrqPpI-m9tbcjNY4q-lN5f3-d6b9MBkvyXvasPNX8O8Ut3Lc4RRvblhhiMn78llxLENq6SpOOtCu0cUuisASoS397pSxpBZ5ZqebK-h-1UHfhn8xxRnut4D6-CUt-HPyduoauqWb-Hp9zbRV3KXXxW09CSMxH1O0nLjz0WUgXHANa8TrOi2dcmLmCAmu3l2yVnsCFr9W9oL75dFHYDE4YuGydULM6a6tqPrzf"},null,null,null,null,null,null,null,null,null,null,null,null,null,null,null,null,null,null,{"$f":"IF(_行ページ!B46=\"\",\"\",_行ページ!B46)","v":1},null,null,null,{"$f":"IF(_行ページ!C46=\"\",\"\",_行ページ!C46)","v":1},null,null,null,{"$f":"IF(_行ページ!D46=\"\",\"\",_行ページ!D46)","v":0},null,null,null,{"$f":"IF(_行ページ!E46=\"\",\"\",_行ページ!E46)","v":1},null,null,null,{"$f":"IF(_行ページ!F46=\"\",\"\",_行ページ!F46)","v":1},null,null,null,{"$f":"IF(_行ページ!G46=\"\",\"\",_行ページ!G46)","v":1}]

{"sheet":"_console","index":11,"n_rows":2387,"n_cols":5,"rows_kept":2387,"cut":false,"hidden":true,"merged":[]}
["Query","Clicks","Impressions","CTR","Position"]
["putty 日本語化",177,1912,9.2600000000000002E-2,6.5]
["putty 日本語",130,5986,2.1700000000000001E-2,9.3000000000000007]
["zip パーミッション",80,181,0.442,1.1000000000000001]
["putty 日本語 設定",79,490,0.16120000000000001,6]
["linux zip パーミッション",51,116,0.43969999999999998,1]
["olfoldercontacts",38,211,0.18010000000000001,6]
["olfolderinbox",31,790,3.9199999999999999E-2,7.9]
["outlook vba 返信メール作成",28,498,5.62E-2,8.1999999999999993]
["patch コマンド",23,2414,9.4999999999999998E-3,9.4]
["zip パーミッション 保持",20,53,0.37740000000000001,1]
["outlook vba",17,560,3.04E-2,30.6]
["outlook vba 添付ファイル 開く",13,161,8.0699999999999994E-2,9.6999999999999993]
["getdefaultfolder",10,802,1.2500000000000001E-2,12.1]
["getdefaultfolder(6)",10,316,3.1600000000000003E-2,9.3000000000000007]
["smarty 変数名 動的",10,127,7.8700000000000006E-2,7.8]
["patchコマンド",9,441,2.0400000000000001E-2,9.1]
["putty ダウンロード 日本語",9,265,3.4000000000000002E-2,8.5]
["outlook vba find",8,105,7.6200000000000004E-2,6.7]
["putty 日本語 ダウンロード 窓の杜",8,341,2.35E-2,8.4]
["bugzilla インストール",7,97,7.22E-2,8.6999999999999993]
["openvpn float",7,46,0.1522,7.2]
["patch directory",7,39,0.17949999999999999,4.0999999999999996]
["putty 日本語 ダウンロード",7,238,2.9399999999999999E-2,9]
["outlook vba sendkeys",6,19,0.31580000000000003,10.9]
["sentonbehalfofname",6,148,4.0500000000000001E-2,11.3]
["outlook マクロ 便利",5,114,4.3900000000000002E-2,20.7]
["putty 日本語版",5,74,6.7599999999999993E-2,9.9]
["ひかりパーソナルフォン",5,159,3.1399999999999997E-2,12.1]
["リバースパッチ",5,206,2.4299999999999999E-2,7.8]
["createobject(\"outlook.application\")",4,134,2.9899999999999999E-2,10.8]
["dreamweaver smarty",4,23,0.1739,8.6]
["items.find",4,44,9.0899999999999995E-2,6]
["olfolderinbox = 6",4,49,8.1600000000000006E-2,8.5]
["outlook vba メール作成",4,36,0.1111,38.299999999999997]
["outlook.application vba",4,64,6.25E-2,22.3]
["patch 改行コード 無視",4,57,7.0199999999999999E-2,7.2]
["smarty 可変変数",4,12,0.33329999999999999,5.3]
["vba outlook",4,104,3.85E-2,42.1]
["log_errors_max_len",3,145,2.07E-2,9.1]
["myattachments.add",3,32,9.3799999999999994E-2,8.5]
["outlook vba reply",3,25,0.12,9]
["outlook vba メール移動",3,17,0.17649999999999999,15.3]
["outlook vba 添付ファイル",3,64,4.6899999999999997E-2,28.8]
["outlook vba 返信",3,63,4.7600000000000003E-2,8.6999999999999993]
["patch コマンド オプション",3,151,1.9900000000000001E-2,7.8]
["putty インストール 日本語",3,122,2.46E-2,8.4]
["putty 日本語 インストール",3,29,0.10340000000000001,7.4]
["putty 窓の杜",3,110,2.7300000000000001E-2,8.6999999999999993]
["puttyjp",3,559,5.4000000000000003E-3,11.2]
["sentonbehalfofname vba outlook",3,47,6.3799999999999996E-2,9.9]
["tar パーミッション 保持",3,66,4.5499999999999999E-2,9.3000000000000007]
["unzip パーミッション",3,58,5.1700000000000003E-2,8.1]
["vba outlook 名前の確認",3,39,7.6899999999999996E-2,11]
["windows patch コマンド",3,41,7.3200000000000001E-2,17.7]
["chkconfig 削除",2,220,9.1000000000000004E-3,7.8]
["excel vba outlook 添付ファイル 保存",2,48,4.1700000000000001E-2,25.4]
["excel vba outlook 添付ファイル 複数",2,7,0.28570000000000001,29.3]
["getdefaultfolder(olfolderinbox)",2,83,2.41E-2,11.4]
["linux zip 権限",2,6,0.33329999999999999,1]
["moviecliploader",2,39,5.1299999999999998E-2,32.1]
["mt コメントアウト",2,417,4.7999999999999996E-3,7.9]
["mynamespace",2,52,3.85E-2,8.3000000000000007]
["mynamespace.getdefaultfolder",2,208,9.5999999999999992E-3,8.6999999999999993]
["olfoldercalendar",2,89,2.2499999999999999E-2,10.199999999999999]
["openvpn client.ovpn",2,4,0.5,24.8]
["outlook createitem",2,53,3.7699999999999997E-2,11.8]
["outlook vba selection",2,21,9.5200000000000007E-2,9.6999999999999993]
["outlook vba フォルダ移動",2,18,0.1111,15.9]
["outlook vba 予定表",2,35,5.7099999999999998E-2,28.8]
["outlook vba 送信日時",2,23,8.6999999999999994E-2,10.9]
["outlook マクロ メール 保存",2,13,0.15379999999999999,37.5]
["outlook マクロ 受信時",2,10,0.2,24.7]
["patch コマンド file to patch",2,17,0.1176,6.8]
["vba getdefaultfolder",2,86,2.3300000000000001E-2,10]
["vba olfolderinbox",2,34,5.8799999999999998E-2,10.6]
["vba outlook attachments",2,3,0.66669999999999996,35]
["wget windows版",2,30,6.6699999999999995E-2,6.2]
["zip permission",2,12,0.16669999999999999,1.9]
["\"outlook.application\"",1,6,0.16669999999999999,9.6999999999999993]
["$dd",1,5,0.2,5.8]
["--with-apxs2",1,21,4.7600000000000003E-2,11.8]
["access vba outlook",1,13,7.6899999999999996E-2,19.5]
["access vba メール送信",1,15,6.6699999999999995E-2,56]
["application.activeexplorer.selection",1,3,0.33329999999999999,9.6999999999999993]
["application.createitem",1,8,0.125,19.5]
["application.session.getdefaultfolder",1,12,8.3299999999999999E-2,16.100000000000001]
["centos postgresql 再起動",1,16,6.25E-2,30.5]
["centos yumex",1,9,0.1111,14.7]
["client.ovpn",1,7,0.1429,24.6]
["createobject outlook",1,44,2.2700000000000001E-2,9.3000000000000007]
["createobject( outlook.application ) vba",1,11,9.0899999999999995E-2,8.5]
["excel vba outlook アドレス帳 取得",1,5,0.2,24.6]
["excel vba outlook 予定表 作成",1,17,5.8799999999999998E-2,26]
["freebsd bugzilla",1,1,1,18]
["getdefaultfolder outlook",1,44,2.2700000000000001E-2,10.199999999999999]
["getdefaultfolder vba",1,46,2.1700000000000001E-2,12.5]
["getnamespace vba",1,7,0.1429,12.9]
["getnamespace(\"mapi\")",1,61,1.6400000000000001E-2,12.6]
["linux zip 除外",1,39,2.5600000000000001E-2,10]
["linux フォルダ圧縮",1,1,1,52]
["mobasif",1,19,5.2600000000000001E-2,27.2]
["mynamespace.getdefaultfolder(6)",1,35,2.86E-2,7]
["new outlook.application",1,8,0.125,19]
["nz関数",1,75,1.3299999999999999E-2,33.5]
["olfolderinbox vba",1,39,2.5600000000000001E-2,7.7]
["olfoldertasks",1,37,2.7E-2,6.9]
["openvpn 2.0 download",1,1,1,2]
["openvpn client ovpn",1,5,0.2,16]
["openvpn 自動接続",1,24,4.1700000000000001E-2,44.5]
["openvpn-2.0.9-gui-1.0.3-install.exe",1,1,1,1]
["outlook activeinspector",1,6,0.16669999999999999,25.8]
["outlook vba categories",1,4,0.25,16.5]
["outlook vba getdefaultfolder",1,40,2.5000000000000001E-2,13.8]
["outlook vba item",1,32,3.1300000000000001E-2,8.4]
["outlook vba print",1,2,0.5,6.5]
["outlook vba timer",1,15,6.6699999999999995E-2,7.7]
["outlook vba フォルダ指定",1,47,2.1299999999999999E-2,21]
["outlook vba メール 移動",1,8,0.125,10.5]
["outlook vba メール本文 取得",1,8,0.125,45.3]
["outlook vba 名前の確認",1,12,8.3299999999999999E-2,13.8]
["outlook vba 差出人 アドレス 取得",1,5,0.2,28.6]
["outlook vba 差出人 変更",1,28,3.5700000000000003E-2,18.5]
["outlook vba 添付ファイル名 取得",1,10,0.1,45.7]
["outlook vba 送信",1,17,5.8799999999999998E-2,31.2]
["outlook マクロ",1,253,4.0000000000000001E-3,54.5]
["outlook マクロ メール作成",1,31,3.2300000000000002E-2,43.3]
["outlook マクロ 転送",1,19,5.2600000000000001E-2,15.3]
["outlook メール vba",1,4,0.25,36]
["outlook 予定表 vba",1,15,6.6699999999999995E-2,29.2]
["outlook 添付ファイル 一括保存 マクロ",1,14,7.1400000000000005E-2,24.4]
["outlook 添付ファイル 削除 マクロ",1,10,0.1,10]
["outlook 添付ファイル 削除 一括 マクロ",1,19,5.2600000000000001E-2,16.3]
["outlook.createitem",1,17,5.8799999999999998E-2,10.8]
["outlookvba",1,73,1.37E-2,10.9]
["patch fuzz",1,15,6.6699999999999995E-2,6.7]
["patch index",1,3,0.33329999999999999,3.7]
["patch コマンド windows",1,19,5.2600000000000001E-2,17.2]
["patch コマンド インストール",1,19,5.2600000000000001E-2,8.6]
["patch コマンド ディレクトリ",1,9,0.1111,9]
["patch コマンド 使い方",1,11,9.0899999999999995E-2,7.4]
["patch: **** strip count l is not a number",1,3,0.33329999999999999,6]
["php5.1.6",1,36,2.7799999999999998E-2,19.600000000000001]
["puttyjp インストール",1,37,2.7E-2,9.4]
["recipient vba",1,5,0.2,12.4]
["resolv-retry",1,2,0.5,4.5]
["resolv-retry infinite",1,11,9.0899999999999995E-2,10.4]
["tar zcvfp",1,4,0.25,3.8]
["tar コマンド 権限",1,2,0.5,17]
["unzip 権限",1,49,2.0400000000000001E-2,9.4]
["vba excel outlook.application",1,1,1,16]
["vba mapi",1,13,7.6899999999999996E-2,12.2]
["vba outlook display",1,29,3.4500000000000003E-2,8.8000000000000007]
["vba outlook find",1,6,0.16669999999999999,5]
["vba outlook getdefaultfolder",1,23,4.3499999999999997E-2,11.1]
["vba outlook 添付",1,4,0.25,19.8]
["vba outlook 表挿入",1,2,0.5,40]
["vba outlook 複数メール作成",1,20,0.05,32.299999999999997]
["vba outlook 起動 確認",1,16,6.25E-2,29.1]
["vba sentonbehalfofname",1,45,2.2200000000000001E-2,9.6]
["vba メール送信 outlook",1,28,3.5700000000000003E-2,36.5]
["weborb",1,18,5.5599999999999997E-2,64.400000000000006]
["wget コマンド windows",1,4,0.25,87]
["yumex centos",1,1,1,6]
["正規表現 で終わらない",1,20,0.05,25]
["窓の杜 putty",1,20,0.05,9.1]
["里村美和",1,8,0.125,20.5]
["長さ0の文字列",1,9,0.1111,43.8]
["\"allowoverride all\"",0,1,0,52]
["\"drwxr-xr-x\"",0,1,0,93]
["$basearch",0,1,0,76]
["$releasever",0,1,0,50]
["--enable-mbstring",0,1,0,80]
["--with-apxs",0,5,0,7.4]
[".createitem(0)",0,2,0,9.5]
[".display vba",0,1,0,12]
[".getdefaultfolder",0,14,0,12.7]
[".getnamespace(\"mapi\")",0,16,0,7.2]
[".gzip",0,4,0,11]
[".tar.gz to zip",0,1,0,61]
[".tar.z",0,1,0,28]
[".z",0,1,0,86]
[".z 解凍",0,4,0,31]
["/etc/httpd/conf/httpd.conf",0,1,0,84]
["/etc/init.d/postgresql restart",0,1,0,68]
["/etc/sysconfig/vncservers",0,1,0,99]
["/etc/yum.repos.d",0,1,0,68]
["/var/cache/yum",0,5,0,56]
["/var/cache/yum 削除",0,1,0,42]
["0 null",0,6,0,76.7]
["192.168.1.22",0,1,0,93]
["192.168.1.2:8080",0,8,0,8.1]
["192.168.1.2:8080/",0,4,0,8.5]
["192.168.1.2：8080",0,2,0,45]
[303,0,1,0,2]
["5900 tcp",0,1,0,43]
["5900/tcp",0,1,0,8]
["#ERROR!",0,2,0,66]
["access outlook vba",0,3,0,21]
["access outlook メール 取り込み",0,24,0,34.1]
["access outlook メール作成",0,1,0,25]
["access outlook メール送信",0,11,0,32.5]
["access sendkeys",0,5,0,83.8]
["access vba const",0,7,0,77.900000000000006]
["access vba delete",0,1,0,80]
["access vba find",0,17,0,61.8]
["access vba inputbox",0,1,0,91]
["access vba msgbox",0,1,0,71]
["access vba outlook.application",0,9,0,9.6]
["access vba print",0,1,0,74]
["access vba redim",0,3,0,91.3]
["access vba sendkeys",0,1,0,76]
["access vba タイマー",0,2,0,81]
["access vba ファイル保存ダイアログ",0,2,0,76.5]
["access vba フォルダを開く",0,1,0,97]
["access vba フォルダ選択",0,1,0,86]
["access vba メッセージ",0,1,0,74]
["access vba メール作成",0,1,0,73]
["access vba メール受信",0,1,0,28]
["access vba メール送信 添付ファイル",0,1,0,39]
["access vba 正規表現",0,4,0,86.5]
["access vba 添付ファイル 表示",0,1,0,27]
["access メール 本文 取り込み",0,1,0,39]
["access メール送信 outlook",0,2,0,33]
["access メール送信 添付ファイル",0,1,0,97]
["access レポート 余白",0,1,0,95]
["activeexplorer",0,1,0,31]
["activeexplorer.selection",0,8,0,19]
["activeexplorer.selection.item(1)",0,1,0,18]
["activeinspector",0,6,0,49.7]
["activeinspector outlook",0,3,0,20.7]
["activeinspector.currentitem",0,27,0,15.6]
["adddefaultcharset shift_jis",0,8,0,76.900000000000006]
["address vba",0,1,0,68]
["addtype",0,1,0,90]
["addtype application",0,3,0,78]
["addtype application/x-httpd-php",0,18,0,61.9]
["addtype application/x-httpd-php .php",0,9,0,62.1]
["addtype application/x-httpd-php-source .phps",0,2,0,27]
["addtype php",0,11,0,63.6]
["aditus",0,1,0,81]
["adobe cs3 ダウンロード",0,1,0,77]
["adobe flex",0,1,0,74]
["adobe flex builder",0,1,0,49]
["af モード",0,1,0,84]
["aix zip",0,2,0,84.5]
["aix zip 圧縮",0,5,0,28.4]
["aix zip 解凍",0,2,0,73]
["aiサーボaf",0,1,0,94]
["aiフォーカスaf",0,9,0,78.099999999999994]
["allowoverride",0,4,0,88.8]
["allowoverride all",0,5,0,62.2]
["allowoverride fileinfo",0,15,0,40.299999999999997]
["allowoverride limit",0,2,0,64]
["allowoverride none",0,13,0,80.900000000000006]
["allowoverride options",0,2,0,41.5]
["anntu",0,2,0,3.5]
["ants games",0,1,0,78]
["antsu",0,1,0,2]
["antu",0,12,0,3.3]
["antz",0,2,0,7]
["apache 1",0,1,0,99]
["apache 2",0,3,0,76]
["apache apxs install",0,1,0,87]
["apache bugzilla",0,2,0,41.5]
["apache centos インストール",0,10,0,55.8]
["apache dso",0,1,0,73]
["apache mbstring",0,5,0,44.8]
["apache php mysql",0,1,0,94]
["apache php postgresql",0,1,0,68]
["apache php ソースが表示される",0,1,0,85]
["apache php ソースコードが表示される",0,1,0,148]
["apache php5",0,1,0,90]
["apache インストール centos",0,35,0,48.8]
["apache ソース インストール",0,2,0,97.5]
["apache 再起動",0,3,0,47.3]
["apache 再起動 centos",0,1,0,96]
["apache2 2",0,1,0,76]
["apache2.2 インストール",0,1,0,77]
["apachectl restart",0,2,0,81.5]
["apache再起動",0,1,0,61]
["application outlook",0,1,0,6]
["application quit vba",0,2,0,85]
["application vba",0,16,0,81.3]
["application. vba",0,2,0,95]
["application.activeexplorer",0,6,0,30.7]
["application.activeinspector",0,1,0,33]
["application.activeinspector.currentitem",0,4,0,15.5]
["application.createitem(olmailitem)",0,6,0,14.2]
["application.getnamespace",0,12,0,9.6]
["application.getnamespace( mapi )",0,1,0,10]
["application.getnamespace(\"mapi\")",0,24,0,9]
["application.quit vba",0,1,0,78]
["application.sendkeys",0,12,0,41.6]
["application.session.folders",0,20,0,17.8]
["application.text vba",0,1,0,26]
["application/x-httpd-php",0,9,0,70.3]
["application/x-httpd-php ダウンロード",0,1,0,87]
["application/x-httpd-php-source",0,2,0,8.5]
["apxs centos",0,1,0,56]
["apxs install",0,3,0,76]
["apxs インストール",0,3,0,69.7]
["apxs2",0,11,0,30.3]
["arch rpm",0,2,0,95]
["arch vnc",0,1,0,95]
["as new outlook.application",0,1,0,10]
["as new vba",0,1,0,48]
["as outlook.application",0,7,0,12.9]
["as ファイル",0,2,0,15]
["asterisk install",0,1,0,49]
["asterisk log",0,2,0,48]
["asterisk mysql password",0,2,0,71]
["asterisk openvpn",0,2,0,30]
["asterisk r",0,1,0,10]
["asterisk rx",0,3,0,8.3000000000000007]
["asterisk インストール",0,29,0,54.4]
["asterisk コマンド",0,11,0,82]
["asterisk 設定",0,1,0,98]
["asファイル",0,11,0,17.100000000000001]
["atrpm",0,1,0,119]
["atrpms",0,1,0,5]
["authentication with old password no longer supported, use 4.1 style passwords",0,1,0,10]
["bash zip -r",0,1,0,10]
["bash zip 解凍",0,6,0,78]
["batch patch",0,1,0,5]
["bootcamp office インストール",0,1,0,80]
["bootcamp windows xp",0,5,0,87.4]
["bootcamp windowsxp",0,3,0,80.3]
["bugzilla",0,3,0,88.3]
["bugzilla apache",0,1,0,10]
["bugzilla centos",0,2,0,4.5]
["bugzilla freebsd",0,1,0,75]
["bugzilla install",0,1,0,20]
["bugzilla windows installer",0,1,0,20]
["bugzilla とは",0,1,0,41]
["bugzilla 日本語",0,3,0,75]
["bundle::cpan",0,1,0,8]
["cd /etc/yum.repos.d/",0,1,0,47]
["cent 4",0,1,0,41]
["cent os 5",0,1,0,98]
["centos 4",0,18,0,54.7]
["centos 5",0,1,0,85]
["centos 5 yum",0,1,0,99]
["centos 6 openvpn",0,1,0,94]
["centos 7 php 5.2",0,1,0,66]
["centos apache アンインストール",0,1,0,75]
["centos apt",0,2,0,80]
["centos apt-key",0,4,0,18.8]
["centos apxs",0,1,0,92]
["centos base repo",0,1,0,85]
["centos bugzilla",0,5,0,29.2]
["centos cleanup",0,1,0,47]
["centos extras",0,3,0,61.7]
["centos flash",0,9,0,82.3]
["centos imap",0,3,0,90.3]
["centos install nslookup",0,1,0,31]
["centos mirror",0,2,0,97.5]
["centos mysql 再起動",0,1,0,99]
["centos nslookup",0,2,0,83.5]
["centos nslookup yum",0,1,0,44]
["centos nslookup インストール",0,2,0,34]
["centos php ini",0,2,0,95.5]
["centos php pdo",0,1,0,137]
["centos php エラーログ",0,1,0,45]
["centos php バージョンアップ",0,6,0,96.2]
["centos php 再起動",0,6,0,28.8]
["centos php 設定",0,1,0,90]
["centos php.ini 場所",0,1,0,97]
["centos postfix",0,13,0,21.6]
["centos postfix dovecot",0,1,0,92]
["centos postfix restart",0,1,0,17]
["centos postfix インストール",0,4,0,41.8]
["centos postfix 設定",0,9,0,40]
["centos postgresql pg_hba.conf",0,1,0,76]
["centos postgresql restart",0,1,0,17]
["centos postgresql インストール",0,3,0,85.7]
["centos postgresql 起動",0,5,0,56.4]
["centos python アンインストール",0,5,0,82]
["centos riken",0,3,0,70.3]
["centos saslauthd",0,2,0,62.5]
["centos sendmail smtp",0,2,0,87]
["centos sendmail インストール",0,1,0,85]
["centos sendmail 設定",0,1,0,97]
["centos subversion",0,3,0,90.7]
["centos tar 圧縮",0,1,0,66]
["centos tgz 解凍",0,1,0,55]
["centos vim インストール",0,2,0,88.5]
["centos vnc 設定",0,1,0,100]
["centos yum 設定",0,6,0,84]
["centos zip コマンド",0,4,0,78]
["centos zip 回答",0,2,0,77]
["centos zip 圧縮",0,30,0,62]
["centos zip 圧縮 ディレクトリ",0,1,0,56]
["centos zip 解凍",0,44,0,77.3]
["centos zip 解凍 コマンド",0,2,0,99]
["centos インストール dvd",0,1,0,97]
["centos インストール パーティション",0,3,0,90]
["centos シンボリックリンク",0,1,0,98]
["centos バージョンアップ",0,1,0,91]
["centos パッケージ管理",0,3,0,94]
["centos 圧縮",0,3,0,91.3]
["centos 導入",0,4,0,91.3]
["centos-base",0,2,0,82]
["centos-base.repo",0,13,0,64.900000000000006]
["centos-extras",0,3,0,72]
["centos4",0,41,0,44.3]
["centos5",0,11,0,80]
["centos5 firewall",0,2,0,28.5]
["centos5 ifconfig",0,1,0,47]
["centos5 iptables",0,7,0,49]
["centos5 php",0,1,0,62]
["centos5 yum",0,1,0,66]
["centos5 インストール",0,8,0,89.5]
["centos5 ダウンロード",0,9,0,48.2]
["centos5.11",0,1,0,74]
["centos6 日本語化",0,3,0,69.7]
["centos7 perl インストール rpm",0,2,0,85]
["centossrv",0,1,0,47]
["cgi コメントアウト",0,1,0,100]
["chconfig",0,1,0,75]
["chess swf",0,5,0,98]
["chkconfig",0,81,0,58.1]
["chkconfig --add",0,6,0,45]
["chkconfig --del",0,7,0,8]
["chkconfig --list",0,8,0,65.400000000000006]
["chkconfig add",0,19,0,19.600000000000001]
["chkconfig add script",0,1,0,21]
["chkconfig del",0,13,0,8.6999999999999993]
["chkconfig file",0,2,0,4]
["chkconfig init.d",0,2,0,39.5]
["chkconfig level",0,5,0,42.4]
["chkconfig list",0,1,0,71]
["chkconfig off",0,4,0,65.3]
["chkconfig on",0,4,0,67]
["chkconfig postgresql on",0,1,0,82]
["chkconfig reset",0,1,0,7]
["chkconfig vncserver on",0,2,0,7.5]
["chkconfig とは",0,1,0,40]
["chkconfig インストール",0,1,0,85]
["chkconfig コマンド",0,164,0,7.9]
["chkconfig ランレベル",0,27,0,21.4]
["chkconfig ランレベル 変更",0,1,0,10]
["chkconfig 停止",0,1,0,83]
["chkconfig 変更",0,13,0,11.6]
["chkconfig 設定",0,1,0,44]
["chkconfig 設定ファイル",0,2,0,9]
["chkconfig 追加",0,3,0,19.3]
["chkconfigコマンド",0,25,0,7.2]
["chmod asterisk",0,1,0,23]
["chmod o+rwx",0,2,0,80]
["chmod o-rwx",0,1,0,50]
["class 'com' not found",0,1,0,18]
["class 'fpdf' not found",0,4,0,27]
["clearsilver",0,1,0,81]
["compress gzip",0,1,0,98]
["compress z",0,2,0,81.5]
["compress 解凍",0,6,0,43]
["conmade",0,1,0,69]
["const vba 意味",0,2,0,83]
["count vba",0,2,0,79]
["cpan",0,13,0,92.8]
["cpan data dumper",0,1,0,70]
["cpan install",0,1,0,94]
["cpan make",0,3,0,29.7]
["create object outlook application",0,1,0,9]
["createitem",0,5,0,35.4]
["createitem outlook",0,5,0,9.6]
["createitem vba",0,4,0,32.5]
["createitem(0)",0,2,0,30]
["createitem(olmailitem)",0,5,0,16.2]
["createobject outlook.application",0,9,0,14.1]
["createobject vba 使い方",0,6,0,33.5]
["createobject( outlook.application )",0,12,0,8.8000000000000007]
["createobject( outlook.application ) attachment",0,1,0,7]
["cs3 ダウンロード",0,4,0,85.5]
["cドライブ end",0,4,0,60]
["dbd pg",0,1,0,86]
["dbd::pg",0,1,0,50]
["dd gzip",0,1,0,77]
["dd if of bs count",0,1,0,31]
["dd seek skip",0,1,0,10]
["dd skip",0,1,0,7]
["dd skip bytes",0,1,0,7]
["dd イメージ マウント windows",0,1,0,111]
["dd コマンド bs",0,1,0,99]
["dd コマンド 使い方",0,3,0,49.7]
["ddo.jp",0,1,0,49]
["ddojp",0,2,0,67]
["ddコマンド",0,1,0,97]
["ddコマンド bs",0,3,0,92]
["ddコマンド count",0,1,0,43]
["ddコマンド オプション",0,2,0,85.5]
["ddコマンド ディスクコピー",0,1,0,101]
["ddコマンド 使い方",0,9,0,64.7]
["delete vba",0,4,0,78.3]
["dependencies resolved",0,1,0,99]
["dependencyresolution",0,1,0,58]
["designer office",0,1,0,2]
["diff directory",0,1,0,49]
["diff patch",0,8,0,73]
["diff patch directory",0,3,0,6.7]
["diff patch コマンド",0,2,0,8.5]
["diff patch 適用",0,2,0,21]
["diff windows コマンド",0,1,0,90]
["diff オプション",0,8,0,91.9]
["diff オプション u",0,1,0,99]
["diff オプション ディレクトリ",0,2,0,78]
["diff オプション 差分のみ",0,2,0,94.5]
["diff コマンド オプション",0,1,0,100]
["diff コマンド ディレクトリ",0,3,0,86.3]
["diff コマンド ファイル名のみ",0,1,0,41]
["diff タブ 無視",0,3,0,92.7]
["diff ディレクトリ",0,5,0,89.2]
["diff パッチ",0,1,0,85]
["diff パッチ 当て方 windows",0,6,0,28]
["diff ファイル名のみ",0,24,0,81]
["diff 差分 カウント",0,1,0,98]
["diff 形式",0,7,0,89.6]
["diff 空白 無視",0,6,0,69]
["diff 除外",0,10,0,87.3]
["dim i as integer 意味",0,1,0,69]
["dim ol as new outlook.application",0,2,0,20]
["dim vba",0,1,0,56]
["dmbパイロットスクール",0,8,0,20.3]
["docutils python",0,1,0,74]
["dom0_mem",0,1,0,67]
["domainu",0,8,0,51.9]
["dreamweaver extension",0,7,0,60.6]
["drwxr-xr-x 3",0,1,0,93]
["dso apache",0,1,0,71]
["dtdns",0,1,0,37]
["ebcdic ascii 変換",0,1,0,87]
["ebcdic コード表",0,4,0,90.8]
["ebcdic 変換 サイト",0,2,0,103.5]
["ebcdic 変換ツール",0,2,0,98.5]
["ed コマンド",0,12,0,80.2]
["edコマンド",0,2,0,86]
["enable-mbstring",0,1,0,80]
["end sub",0,2,0,91]
["end vba",0,7,0,66.3]
["end ファイル cドライブ",0,1,0,95]
["excel find vba",0,4,0,76.8]
["excel outlook vba",0,1,0,81]
["excel outlook メール作成",0,12,0,56.8]
["excel outlook 予定表",0,1,0,45]
["excel search 正規表現",0,1,0,100]
["excel vba find",0,6,0,85.8]
["excel vba find 正規表現",0,1,0,62]
["excel vba findnext",0,4,0,87.8]
["excel vba goto end sub",0,1,0,88]
["excel vba mail",0,1,0,64]
["excel vba open outlook email",0,1,0,10]
["excel vba outlook",0,45,0,57]
["excel vba outlook calendar",0,1,0,17]
["excel vba outlook アドレス帳 検索",0,18,0,24.9]
["excel vba outlook メール 取得",0,23,0,37.799999999999997]
["excel vba outlook メール作成",0,25,0,55.4]
["excel vba outlook メール取得",0,7,0,36.700000000000003]
["excel vba outlook メール送信",0,1,0,40]
["excel vba outlook メール送信 添付ファイル",0,4,0,24.8]
["excel vba outlook 予定表",0,3,0,32.299999999999997]
["excel vba outlook 予定表 取得",0,22,0,34.6]
["excel vba outlook 添付ファイル",0,5,0,32.200000000000003]
["excel vba outlook 表 貼り付け",0,4,0,41.8]
["excel vba outlook 起動",0,1,0,53]
["excel vba outlook.application",0,4,0,12.8]
["excel vba sendkey",0,2,0,96]
["excel vba sendkeys",0,3,0,90.3]
["excel vba アラート",0,2,0,94]
["excel vba メール",0,21,0,75.2]
["excel vba メール作成",0,33,0,68.7]
["excel vba メール作成 宛先 複数",0,5,0,58.6]
["excel vba メール送信",0,19,0,87.2]
["excel vba メール送信 添付ファイル",0,3,0,81.3]
["excel マクロ findnext",0,1,0,60]
["excel マクロ outlook",0,1,0,79]
["excel マクロ outlook メール作成",0,2,0,58]
["excel マクロ メール",0,4,0,66.8]
["excel マクロ メール作成",0,9,0,73.8]
["excel マクロ メール送信",0,13,0,79.7]
["excel メール作成 マクロ",0,1,0,83]
["excel メール送信 outlook",0,6,0,62.8]
["excel メール送信 vba",0,7,0,81.3]
["excel メール送信 マクロ",0,18,0,83.4]
["excelマクロ メール送信",0,2,0,78.5]
["execcgi",0,6,0,50.8]
["expose_php",0,1,0,65]
["expose_php = off",0,4,0,39.5]
["expose_php off htaccess",0,1,0,25]
["expose_php=off",0,1,0,35]
["ext-mbstring",0,1,0,99]
["fatal error class not found",0,1,0,51]
["fatal error: class '' not found in",0,1,0,39]
["fatal error: class 'fpdf' not found in",0,2,0,8]
["fedora clean",0,1,0,55]
["fedora root ログイン",0,1,0,71]
["fedora root 初期パスワード",0,1,0,91]
["fedora vnc",0,17,0,66.099999999999994]
["fedora vnc server",0,2,0,60]
["fedora vncserver",0,1,0,23]
["fedora yumex",0,1,0,9]
["fedora リモートデスクトップ",0,1,0,86]
["file to patch",0,19,0,18.3]
["file to patch:",0,6,0,27.8]
["find nothing vba",0,1,0,80]
["find outlook",0,1,0,4]
["find vba",0,38,0,68.099999999999994]
["find what vba",0,1,0,51]
["find マクロ",0,9,0,82.7]
["findnext nothing",0,1,0,69]
["findnext vba",0,19,0,82.1]
["findメソッド vba",0,1,0,93]
["flex build",0,1,0,87]
["flex builder 2",0,1,0,87]
["flex component",0,2,0,8]
["flexbuilder",0,3,0,44]
["float margin",0,2,0,90]
["float margin 効かない",0,11,0,66.400000000000006]
["float office",0,5,0,6.8]
["float openvpn",0,2,0,5.5]
["float right 効かない",0,9,0,72.3]
["followsymlinks",0,7,0,59.6]
["followsymlinks multiviews",0,1,0,45]
["for to vba",0,9,0,60.8]
["fpdf 使い方",0,1,0,60]
["freebsd firefox 日本語化",0,2,0,64.5]
["freebsd zip",0,1,0,69]
["freebsd 日本語化",0,1,0,95]
["ftp riken",0,14,0,86.9]
["ftp.rediris.es",0,1,0,8]
["ftp.riken",0,2,0,82]
["fuzz patch",0,1,0,7]
["get_include_path()",0,1,0,97]
["getdefaultfolder 受信トレイ",0,1,0,19]
["getdefaultfolder 引数",0,1,0,14]
["getdefaultfolder(9)",0,7,0,6.9]
["getdefaultfolder(olfoldercalendar)",0,6,0,7.2]
["getdefaultview",0,1,0,39]
["getnamespace",0,14,0,24.4]
["getnamespace mapi",0,3,0,12.3]
["getnamespace outlook",0,1,0,10]
["getnamespace( mapi )",0,12,0,13.5]
["getshareddefaultfolder",0,1,0,60]
["gpg key retrieval failed:",0,1,0,75]
["gpgkey とは",0,1,0,63]
["gz tar 解凍",0,1,0,84]
["gz tgz",0,2,0,12]
["gz z",0,1,0,10]
["gz ファイル",0,1,0,82]
["gz ファイル 解凍",0,5,0,71]
["gz 回答",0,6,0,66]
["gz 展開",0,27,0,60]
["gz 解凍",0,10,0,77.2]
["gz 解凍 linux",0,2,0,124.5]
["gz 解答",0,2,0,68]
["gzip gz",0,1,0,59]
["gzip tar.gz",0,1,0,63]
["gzip tgz",0,3,0,65.3]
["gzip zip 違い",0,10,0,91.5]
["gzip 展開",0,19,0,79.400000000000006]
["gzip 解凍",0,3,0,86.3]
["gzファイル 展開",0,1,0,61]
["gzファイル 解凍",0,2,0,85.5]
["gz解凍",0,1,0,75]
["home_mailbox = maildir/",0,1,0,82]
["home_mailbox postfix",0,1,0,56]
["hosts ファイル 場所",0,2,0,93.5]
["hostsファイル 場所",0,1,0,85]
["hp-ux zip",0,1,0,45]
["htaccess execcgi",0,1,0,52]
["htaccess ini_set",0,1,0,70]
["htaccess memory_limit",0,1,0,57]
["htaccess options multiviews",0,1,0,55]
["htaccess コメントアウト 複数行",0,5,0,92.4]
["html asterisk",0,2,0,11]
["http//192.168.1.2:8080",0,1,0,8]
["httpd conf 場所",0,11,0,67.400000000000006]
["httpd php 設定",0,5,0,56.6]
["httpd.conf allowoverride",0,2,0,79]
["httpd.conf 場所",0,29,0,70.099999999999994]
["httpdconf 場所",0,2,0,35]
["hunkオリジナル",0,5,0,25.4]
["importerror: no module named setuptools",0,1,0,61]
["indexes followsymlinks",0,3,0,61]
["ini 編集",0,1,0,141]
["ini_set memory_limit",0,10,0,50.8]
["ini_set memory_limit -1",0,1,0,6]
["ini_set php",0,1,0,82]
["ini_set upload_max_filesize",0,1,0,94]
["ini_set('memory_limit'",0,1,0,23]
["ini_set('memory_limit',",0,1,0,96]
["ini_set('memory_limit', -1);",0,3,0,7.7]
["iniset php",0,1,0,54]
["init.d chkconfig",0,3,0,55]
["inputbox 複数",0,1,0,99]
["install apxs",0,1,0,99]
["install libphp5.so centos",0,1,0,73]
["install xdebug",0,1,0,44]
["instr",0,1,0,97]
["integer 意味 vba",0,1,0,70]
["item vba",0,1,0,10]
["item.subject vba",0,2,0,13]
["items.find method (outlook)",0,2,0,7]
["items.find outlook vba",0,4,0,7.8]
["javaapplet",0,2,0,71]
["javascript == -1",0,1,0,81]
["javascript === undefined",0,1,0,86]
["javascript nan 判定",0,13,0,85.9]
["javascript null undefined 使い分け",0,3,0,57.3]
["javascript null undefined 判定",0,15,0,79]
["javascript null 判定",0,97,0,81.5]
["javascript null 判定 ===",0,2,0,82.5]
["javascript null 変換",0,1,0,80]
["javascript null 空文字 変換",0,2,0,91.5]
["javascript nullチェック",0,1,0,94]
["javascript null判定",0,9,0,90.3]
["javascript object null 判定",0,2,0,49.5]
["javascript object 判定",0,7,0,78.099999999999994]
["javascript object 空 判定",0,1,0,90]
["javascript true 判定",0,2,0,71.5]
["javascript undefined",0,47,0,82.2]
["javascript undefined null",0,1,0,100]
["javascript undefined null 判定",0,23,0,66.2]
["javascript undefined チェック",0,8,0,71.900000000000006]
["javascript undefined 代入",0,20,0,55.2]
["javascript undefined 判定",0,166,0,41.9]
["javascript undefined 空文字 変換",0,1,0,60]
["javascript undefinedとは",0,2,0,97]
["javascript undifined",0,2,0,98]
["javascript オブジェクト",0,1,0,97]
["javascript オブジェクト 存在チェック undefined",0,2,0,80]
["javascript 予約語",0,4,0,68.8]
["javascript 可変変数",0,2,0,76.5]
["jpackage",0,25,0,14.1]
["jpackager",0,1,0,10]
["jpgraph",0,6,0,67.7]
["jpgraph インストール",0,5,0,57.2]
["jpgraph 使い方",0,4,0,58.3]
["jre linux",0,4,0,88.5]
["libphp5.so ない",0,7,0,73.400000000000006]
["libphp5.so インストール",0,1,0,100]
["libpri asterisk",0,1,0,9]
["linux dd バックアップ",0,6,0,89.3]
["linux dd ファイル作成",0,1,0,93]
["linux ddコマンド 使い方",0,4,0,50.5]
["linux ebcdic to ascii",0,1,0,49]
["linux find zip files",0,1,0,86]
["linux gz 圧縮",0,2,0,93.5]
["linux gzip 圧縮",0,4,0,94.5]
["linux gzip 圧縮 ディレクトリ",0,1,0,96]
["linux java applet",0,1,0,6]
["linux jre インストール",0,3,0,80.3]
["linux patch コマンド インストール",0,1,0,20]
["linux postgresql インストール",0,2,0,86]
["linux postgresql 再起動",0,1,0,25]
["linux svn インストール",0,17,0,92.1]
["linux svn インストール 場所",0,1,0,94]
["linux tar",0,1,0,98]
["linux tar -c",0,4,0,80.5]
["linux tar zip",0,15,0,58.4]
["linux tar 圧縮",0,2,0,94]
["linux tar 複数ファイル",0,1,0,72]
["linux tar 解凍",0,6,0,88.7]
["linux tar 除外",0,3,0,54.7]
["linux tgz",0,1,0,99]
["linux tgz 解凍",0,2,0,95]
["linux zip",0,10,0,79.900000000000006]
["linux zip -r",0,2,0,27.5]
["linux zip command",0,3,0,91]
["linux zip exclude directory",0,3,0,41.3]
["linux zip tar",0,2,0,88.5]
["linux zip コマンド",0,70,0,79.7]
["linux zip ディレクトリ",0,12,0,95.5]
["linux zip ディレクトリ 除外",0,23,0,25.8]
["linux zip フォルダ",0,8,0,50.6]
["linux zip 回答",0,7,0,91.6]
["linux zip 圧縮",0,522,0,53.2]
["linux zip 圧縮 コマンド",0,1,0,85]
["linux zip 圧縮 ディレクトリ",0,21,0,59.9]
["linux zip 圧縮 複数ファイル",0,1,0,70]
["linux zip 展開",0,3,0,68.7]
["linux zip 解凍",0,90,0,93.4]
["linux zip 解凍 tar",0,9,0,72.900000000000006]
["linux zip 解凍 コマンド",0,6,0,91]
["linux zip 解凍 ディレクトリ",0,4,0,90.3]
["linux zipコマンド",0,23,0,75.599999999999994]
["linux zip圧縮",0,3,0,41]
["linux オーナー",0,1,0,94]
["linux コマンド zip",0,23,0,83.2]
["linux コマンド zip 圧縮",0,1,0,75]
["linux コマンド zip 解凍",0,3,0,94.3]
["linux コマンド 解凍",0,2,0,95]
["linux ディレクトリ 圧縮",0,3,0,97.7]
["linux ディレクトリ 圧縮 zip",0,2,0,65]
["linux ディレクトリ圧縮",0,1,0,95]
["linux パーミッション",0,1,0,91]
["linux ファイル圧縮",0,1,0,97]
["linux フォルダ zip",0,1,0,66]
["linux フォルダ 圧縮",0,27,0,67.900000000000006]
["linux フォルダ 圧縮 zip",0,2,0,48.5]
["linux 圧縮",0,2,0,79.5]
["linux 圧縮 tar.gz",0,1,0,89]
["linux 圧縮 tgz",0,6,0,69.8]
["linux 圧縮 zip",0,82,0,67.2]
["linux 圧縮 ディレクトリ",0,6,0,92.5]
["linux 圧縮 解凍",0,4,0,91.5]
["linux 権限",0,1,0,96]
["linux 解凍",0,1,0,99]
["linux 解凍 tar.gz",0,1,0,92]
["linux 解凍 zip",0,24,0,83.2]
["linux 解凍 コマンド",0,4,0,77.5]
["linux 解凍コマンド",0,2,0,95.5]
["linux 起動 スクリプト",0,1,0,90]
["lksctp",0,1,0,31]
["lksctp-tools rpm",0,1,0,57]
["ln -s コマンド",0,1,0,98]
["ln s コマンド",0,2,0,65.5]
["ln s シンボリックリンク",0,1,0,73]
["ln コマンド",0,295,0,61.6]
["ln コマンド シンボリックリンク",0,7,0,57.1]
["ln シンボリックリンク",0,17,0,46.2]
["lnコマンド",0,35,0,65.2]
["loadmovie",0,1,0,97]
["mac zip コマンド",0,3,0,97.3]
["mac zip 圧縮 コマンド",0,9,0,94.9]
["mac zip 解凍 コマンド",0,6,0,95.5]
["mailitem close",0,1,0,27]
["mailitem vba",0,2,0,34]
["mailitem.categories vba",0,1,0,9]
["mailitem.move",0,2,0,25.5]
["mailitem.sentonbehalfofname",0,1,0,7]
["main.cf mydestination",0,1,0,76]
["mantis admin",0,2,0,24.5]
["mantis administrator",0,1,0,40]
["mantis administrator password",0,1,0,101]
["mantis db",0,1,0,107]
["mantis install",0,2,0,36]
["mantis インストール",0,29,0,28.2]
["mantis 使い方",0,1,0,60]
["mapi getdefaultfolder",0,18,0,11.5]
["mapi outlook",0,2,0,64.5]
["mapi outlook 2007",0,1,0,33]
["mapi vba",0,8,0,12.4]
["mapi メール送信",0,1,0,56]
["mbfpdf",0,2,0,56.5]
["mbstring インストール",0,10,0,60.5]
["mcpan",0,1,0,21]
["memory_limit htaccess",0,3,0,58.3]
["memory_limit ini_set",0,1,0,52]
["mfc 正規表現",0,1,0,95]
["microsoft outlook vba",0,2,0,39.5]
["microsoft vba for outlook",0,1,0,28]
["mod_python インストール",0,5,0,83.6]
["moviclip",0,2,0,3.5]
["mp3 youtube アップロード",0,6,0,96.3]
["msaccess msgbox",0,1,0,82]
["mt putty",0,4,0,5.8]
["mt タグ",0,22,0,69]
["mt プラグイン インストール",0,3,0,65.3]
["mt 文字化け",0,42,0,45.7]
["mtignore",0,23,0,49.4]
["mtタグ",0,7,0,65.099999999999994]
["mydestination main.cf",0,1,0,89]
["mydomain postfix",0,1,0,96]
["myfolder",0,1,0,26]
["myhostname postfix",0,1,0,82]
["myitem",0,4,0,5]
["mysql old_passwords",0,1,0,89]
["mysql インストール centos",0,4,0,93.8]
["mysqli yum",0,1,0,82]
["mysqli インストール",0,11,0,82.5]
["mysqli 拡張がありません。php の設定をチェックしてみてください。",0,5,0,85.4]
["nan javascript 判定",0,2,0,72]
["ncftpget",0,1,0,60]
["ncurses-devel",0,1,0,71]
["no module named setuptools",0,1,0,25]
["nslookup smtp",0,1,0,65]
["nslookup インストール",0,3,0,57.7]
["ntt パーソナル",0,1,0,95]
["nttパーソナル",0,5,0,85.8]
["null if",0,1,0,97]
["null undefined 判定",0,1,0,65]
["null 判定",0,1,0,89]
["null 判定 javascript",0,1,0,85]
["null 文字",0,2,0,98]
["null文字",0,4,0,92]
["null点",0,1,0,13]
["number patch",0,1,0,7]
["number_format smarty",0,5,0,80.599999999999994]
["nz 関数",0,39,0,34]
["nz関数 クエリ",0,3,0,37.299999999999997]
["obj-y",0,1,0,9]
["object object javascript",0,1,0,95]
["obs バックアップ",0,1,0,77]
["office 2007 日本語化",0,32,0,53.7]
["office ants",0,3,0,11]
["office centos",0,1,0,75]
["office designer",0,3,0,2]
["office vba なくなる",0,9,0,74.900000000000006]
["office 日本語化",0,24,0,83.9]
["ofi",0,9,0,6.3]
["olbyvalue vba",0,1,0,17]
["old_passwords",0,1,0,91]
["olfolderdeleteditems",0,6,0,11.2]
["olfolderdrafts",0,12,0,12.7]
["olfoldersentmail",0,40,0,5.2]
["olmailitem",0,19,0,36.700000000000003]
["olmailitem vba",0,5,0,18.2]
["olmailitem 定数",0,54,0,6.5]
["open outlook vba",0,1,0,17]
["open vpn",0,1,0,93]
["open vpn client",0,1,0,77]
["open vpn ポート",0,4,0,85.8]
["open vpn ルーター",0,1,0,85]
["openvpn",0,68,0,77.7]
["openvpn 1.0.3",0,3,0,34.299999999999997]
["openvpn 2.0.9",0,1,0,10]
["openvpn cert",0,1,0,74]
["openvpn client",0,9,0,75]
["openvpn client config",0,1,0,76]
["openvpn client nobind",0,2,0,63.5]
["openvpn client to client",0,4,0,86.5]
["openvpn client 設定",0,31,0,40]
["openvpn comp-lzo",0,1,0,66]
["openvpn conf",0,1,0,36]
["openvpn config",0,3,0,57.7]
["openvpn config client",0,1,0,47]
["openvpn config 設定",0,1,0,27]
["openvpn firefox",0,1,0,29]
["openvpn gui",0,4,0,84.5]
["openvpn gui 接続できない",0,3,0,38.299999999999997]
["openvpn install",0,1,0,75]
["openvpn ip",0,1,0,96]
["openvpn ipアドレス",0,1,0,47]
["openvpn opvn",0,1,0,51]
["openvpn ovpn",0,6,0,40.799999999999997]
["openvpn pull",0,2,0,8.5]
["openvpn resolv-retry",0,9,0,8]
["openvpn resolv-retry infinite",0,7,0,10.6]
["openvpn resolv.conf",0,1,0,22]
["openvpn site to site config",0,1,0,34]
["openvpn url",0,1,0,25]
["openvpn verb 3",0,1,0,46]
["openvpn windows クライアント",0,14,0,74.8]
["openvpn windows サーバ",0,8,0,92.9]
["openvpn windows 設定",0,120,0,79.3]
["openvpn インストール",0,44,0,61.8]
["openvpn クライアント",0,42,0,72]
["openvpn クライアント windows",0,2,0,77]
["openvpn クライアント 設定",0,51,0,34.5]
["openvpn クライアント証明書",0,1,0,67]
["openvpn サーバ",0,4,0,79]
["openvpn ダウンロード",0,9,0,63.8]
["openvpn ポート",0,50,0,66.2]
["openvpn ポート番号",0,15,0,27.7]
["openvpn ライセンス",0,5,0,45.4]
["openvpn ルータ",0,2,0,80.5]
["openvpn 再接続",0,4,0,7.3]
["openvpn 接続",0,1,0,86]
["openvpn 構築",0,9,0,84.1]
["openvpn 設定",0,176,0,57.7]
["openvpn 設定 windows",0,18,0,85.1]
["openvpn 設定ファイル",0,12,0,54.5]
["openvpn 証明書",0,1,0,97]
["openvpn.exe",0,2,0,45]
["openvpn.ovpn",0,1,0,30]
["openvpnとは",0,3,0,104.3]
["openvpnクライアント",0,12,0,60.7]
["openvpnサーバ",0,1,0,55]
["openvpn設定",0,1,0,65]
["opnevpn",0,1,0,76]
["options execcgi",0,1,0,100]
["options followsymlinks and symlinksifownermatch are both off",0,2,0,25]
["options followsymlinks execcgi",0,1,0,17]
["options includes followsymlinks",0,1,0,85]
["options indexes followsymlinks",0,6,0,58]
["options indexes followsymlinks execcgi",0,1,0,46]
["options indexes followsymlinks includes execcgi",0,3,0,18.7]
["options indexes multiviews followsymlinks",0,1,0,56]
["options multiviews",0,8,0,63.9]
["orig 拡張子",0,1,0,86]
["out look 意味",0,1,0,81]
["outbox 意味",0,6,0,76.7]
["outlook 2010 vba",0,10,0,28.6]
["outlook 2010 マクロ",0,9,0,66.599999999999994]
["outlook 2013 vba",0,3,0,35]
["outlook 2013 マクロ",0,3,0,63]
["outlook activeexplorer",0,3,0,36.700000000000003]
["outlook api",0,9,0,84.6]
["outlook application",0,57,0,24.1]
["outlook application vba",0,7,0,63.9]
["outlook attachment",0,1,0,57]
["outlook createobject",0,15,0,9.1]
["outlook excel vba",0,10,0,68.400000000000006]
["outlook find",0,9,0,6.8]
["outlook getdefaultfolder",0,79,0,14]
["outlook getnamespace",0,12,0,13.9]
["outlook getshareddefaultfolder",0,1,0,17]
["outlook item",0,2,0,32.5]
["outlook macro security",0,1,0,50]
["outlook mail vba",0,2,0,27]
["outlook mailitem display",0,1,0,20]
["outlook makuro",0,6,0,50]
["outlook mapi",0,1,0,88]
["outlook msg 一括 保存",0,2,0,44]
["outlook msgbox",0,1,0,39]
["outlook open vba",0,2,0,8.5]
["outlook recipient",0,2,0,76.5]
["outlook recipients",0,1,0,39]
["outlook reply to",0,1,0,71]
["outlook reply-to",0,1,0,60]
["outlook selection",0,2,0,8.5]
["outlook sentonbehalfofname",0,2,0,5]
["outlook vb",0,3,0,28.3]
["outlook vba application",0,16,0,6.3]
["outlook vba attachments",0,1,0,40]
["outlook vba body",0,2,0,47]
["outlook vba cc アドレス 取得",0,1,0,53]
["outlook vba createitem",0,7,0,9]
["outlook vba current mail item",0,1,0,7]
["outlook vba currentitem",0,1,0,10]
["outlook vba display",0,2,0,8]
["outlook vba excel",0,42,0,55.8]
["outlook vba excel 開く",0,9,0,17.399999999999999]
["outlook vba folder",0,1,0,21]
["outlook vba folders",0,5,0,21.6]
["outlook vba from",0,2,0,30.5]
["outlook vba get recipient email address",0,1,0,19]
["outlook vba getnamespace",0,14,0,19.2]
["outlook vba inputbox",0,6,0,15.8]
["outlook vba items",0,31,0,9.1]
["outlook vba mail",0,1,0,63]
["outlook vba mailitem",0,10,0,37.9]
["outlook vba mapi",0,5,0,9.4]
["outlook vba move email to folder",0,1,0,9]
["outlook vba msgbox",0,10,0,17.3]
["outlook vba olfolderinbox",0,1,0,9]
["outlook vba open file",0,1,0,10]
["outlook vba print attachment",0,1,0,25]
["outlook vba recipients",0,4,0,39]
["outlook vba saveas",0,1,0,10]
["outlook vba search",0,1,0,19]
["outlook vba search email subject",0,1,0,10]
["outlook vba select folder",0,2,0,14]
["outlook vba select mail item",0,1,0,9]
["outlook vba send mail",0,1,0,18]
["outlook vba sentonbehalfofname",0,2,0,6]
["outlook vba subject",0,1,0,78]
["outlook vba アカウント 取得",0,2,0,29.5]
["outlook vba アドレス 取得",0,1,0,59]
["outlook vba アドレス帳",0,2,0,18]
["outlook vba アドレス帳 検索",0,12,0,25.7]
["outlook vba イベント 一覧",0,1,0,58]
["outlook vba フォルダ一覧",0,2,0,49]
["outlook vba フォルダ作成",0,17,0,22.4]
["outlook vba フォルダ名 取得",0,8,0,27.4]
["outlook vba マクロ",0,23,0,53.1]
["outlook vba メール 本文 取得",0,11,0,48.8]
["outlook vba メール 転送",0,7,0,12.9]
["outlook vba メールアドレス 取得",0,1,0,39]
["outlook vba メール保存",0,1,0,36]
["outlook vba メール削除",0,7,0,11.1]
["outlook vba メール転送",0,16,0,12.3]
["outlook vba メール送信",0,21,0,37.200000000000003]
["outlook vba 予定表 取得",0,7,0,32.6]
["outlook vba 件名 取得",0,2,0,46.5]
["outlook vba 使い方",0,1,0,9]
["outlook vba 便利",0,3,0,19.3]
["outlook vba 受信メール 件名 取得",0,21,0,34.200000000000003]
["outlook vba 受信日時",0,11,0,29.5]
["outlook vba 宛先 アドレス 取得",0,3,0,44]
["outlook vba 宛先 取得",0,14,0,52.9]
["outlook vba 宛先アドレス 取得",0,2,0,49.5]
["outlook vba 実行",0,2,0,26]
["outlook vba 差出人",0,2,0,29]
["outlook vba 差出人 取得",0,7,0,27.6]
["outlook vba 本文",0,2,0,52]
["outlook vba 検索",0,14,0,22.2]
["outlook vba 添付ファイル チェック",0,5,0,47.8]
["outlook vba 添付ファイル 保存",0,27,0,34.299999999999997]
["outlook vba 添付ファイル 自動保存",0,3,0,21.7]
["outlook vba 起動",0,2,0,61]
["outlook vba 転送",0,11,0,16.7]
["outlook vba 返信先の指定",0,12,0,8.4]
["outlook vba 送信元アドレス",0,3,0,19.3]
["outlook vba 送信者 アドレス 取得",0,4,0,36.299999999999997]
["outlook vba 選択したメール",0,31,0,9.4]
["outlook vba 配布",0,14,0,26.4]
["outlook すべてのメール",0,1,0,72]
["outlook すべて選択",0,1,0,46]
["outlook まとめて削除",0,1,0,85]
["outlook アイテム",0,8,0,60.3]
["outlook アイテム数",0,2,0,81.5]
["outlook アーカイブ 作成",0,2,0,84.5]
["outlook スクリプト",0,15,0,54.1]
["outlook スクリプトを実行する",0,1,0,39]
["outlook スクリプトを実行する ない",0,1,0,64]
["outlook スケジューラ vbs",0,3,0,21]
["outlook スケジュール 投票",0,1,0,64]
["outlook タイマー",0,8,0,39]
["outlook フォルダ 並べ替え",0,1,0,75]
["outlook フォルダ 移動",0,5,0,87]
["outlook フォルダ 表示",0,1,0,80]
["outlook フォルダ 順番",0,2,0,56]
["outlook プロジェクト管理",0,4,0,88.5]
["outlook ポップアップ 返信",0,1,0,45]
["outlook マクロ ボタン",0,2,0,36]
["outlook マクロ メール送信",0,3,0,41]
["outlook マクロ 予定 作成",0,2,0,28.5]
["outlook マクロ 予定表",0,17,0,29]
["outlook マクロ 作成",0,11,0,48.1]
["outlook マクロ 削除",0,12,0,18.8]
["outlook マクロ 定期実行",0,8,0,36]
["outlook マクロ 宛先",0,1,0,58]
["outlook マクロ 実行",0,6,0,35.5]
["outlook マクロ 添付ファイル",0,37,0,36]
["outlook マクロ 添付ファイル 保存",0,1,0,45]
["outlook マクロ 登録",0,4,0,27]
["outlook マクロ 自動実行",0,24,0,27.7]
["outlook マクロ 設定",0,1,0,25]
["outlook マクロ 配布",0,33,0,23.8]
["outlook メッセージ 取り消し",0,3,0,72.7]
["outlook メモ",0,8,0,79.599999999999994]
["outlook メモ 使い方",0,3,0,69.3]
["outlook メーリングリスト 仕分け",0,1,0,63]
["outlook メーリングリスト 送信",0,1,0,96]
["outlook メール テキスト 出力 マクロ",0,14,0,30.8]
["outlook メール テキスト保存",0,1,0,72]
["outlook メール テキスト出力 マクロ",0,20,0,22.9]
["outlook メール マクロ",0,4,0,56.3]
["outlook メール メモ",0,3,0,74.7]
["outlook メール 件数 vba",0,5,0,15]
["outlook メール 件数 カウント",0,1,0,20]
["outlook メール 件数 カウント マクロ",0,4,0,21]
["outlook メール 取り消し",0,20,0,88.6]
["outlook メール 返信 添付ファイル",0,1,0,89]
["outlook メールボックス 移動",0,1,0,84]
["outlook メール作成 マクロ",0,1,0,43]
["outlook メール取り消し",0,4,0,75]
["outlook メール数 カウント",0,5,0,23]
["outlook メール移動 一括",0,1,0,79]
["outlook 予定表 アーカイブ",0,1,0,77]
["outlook 予定表 エクセル",0,1,0,74]
["outlook 予定表 フォルダ",0,1,0,85]
["outlook 予定表 マクロ",0,13,0,26.8]
["outlook 予定表 削除",0,1,0,101]
["outlook 予定表 削除 一括",0,1,0,64]
["outlook 予定表 添付ファイル",0,1,0,55]
["outlook 仕分け ワイルドカード 件名",0,1,0,46]
["outlook 仕分け 正規表現",0,2,0,59]
["outlook 件名のみ表示",0,1,0,59]
["outlook 会議室予約 自動 vba",0,2,0,33]
["outlook 使い方 便利",0,1,0,88]
["outlook 便利 マクロ",0,24,0,12]
["outlook 保存先 削除",0,1,0,86]
["outlook 別の日時を指定",0,1,0,79]
["outlook 削除済みアイテム 表示されない",0,1,0,108]
["outlook 引用 挿入",0,1,0,72]
["outlook 投票 複数選択",0,1,0,40]
["outlook 投票ボタン",0,6,0,81.8]
["outlook 投票ボタン 使い方",0,1,0,59]
["outlook 投票ボタン 本文",0,2,0,60]
["outlook 投票ボタン 表示されない",0,4,0,74.3]
["outlook 投票ボタン 集計",0,2,0,48.5]
["outlook 投票ボタン 集計されない",0,1,0,49]
["outlook 投票ボタンが表示されない",0,1,0,59]
["outlook 投稿",0,1,0,87]
["outlook 振り分け 正規表現",0,1,0,70]
["outlook 新しいアイテム",0,1,0,35]
["outlook 新しいフォルダ",0,1,0,81]
["outlook 新着メール",0,4,0,75.3]
["outlook 新規",0,7,0,72]
["outlook 新規メール",0,5,0,68.400000000000006]
["outlook 新規作成",0,2,0,72.5]
["outlook 既定",0,1,0,70]
["outlook 検索 本文のみ",0,2,0,50.5]
["outlook 検索 正規表現",0,1,0,74]
["outlook 正規表現",0,1,0,54]
["outlook 添付ファイル 一括保存",0,19,0,69.099999999999994]
["outlook 添付ファイル 一括削除",0,2,0,76.5]
["outlook 添付ファイル 保存 マクロ",0,8,0,31.3]
["outlook 添付ファイル 保存 一括",0,1,0,77]
["outlook 添付ファイル 削除 一括",0,12,0,58.1]
["outlook 添付ファイル 自動保存",0,1,0,68]
["outlook 添付ファイル 返信",0,2,0,68.5]
["outlook 無題の添付ファイル",0,6,0,48]
["outlook 自動送信 マクロ",0,11,0,29.9]
["outlook 自動送受信",0,3,0,91]
["outlook 複数メール 添付ファイル 一括保存",0,2,0,65]
["outlook 返信",0,2,0,87.5]
["outlook 返信 ポップアップ",0,3,0,37]
["outlook 返信 添付",0,2,0,70.5]
["outlook 返信 添付ファイル",0,12,0,66.3]
["outlook 返信 添付ファイル そのまま",0,2,0,37.5]
["outlook 返信 添付ファイル 削除",0,1,0,60]
["outlook 返信ボタン",0,3,0,68.3]
["outlook 返信先",0,1,0,77]
["outlook 送信 削除",0,2,0,92]
["outlook 送信 確認 ポップアップ",0,12,0,83.8]
["outlook 送信のみ",0,4,0,69.5]
["outlook 送信トレイ",0,12,0,91.1]
["outlook 送信トレイ どこ",0,1,0,84]
["outlook 送信トレイ 表示",0,4,0,87.5]
["outlook 送信トレイ 送信済み",0,6,0,82.2]
["outlook 送信フォルダ",0,1,0,90]
["outlook 送信ボタン",0,7,0,72.3]
["outlook 送信ボックス",0,1,0,98]
["outlook 送信メール 取り消し",0,1,0,88]
["outlook 送信前 確認 マクロ",0,3,0,54.3]
["outlook 送信済み",0,7,0,82.7]
["outlook 送信済み フォルダ ない",0,1,0,88]
["outlook 送信済みアイテム",0,7,0,70.900000000000006]
["outlook 送信済みアイテム 仕分け",0,1,0,56]
["outlook 送信済みアイテムフォルダ 表示されない",0,4,0,75.8]
["outlook 送信済みメール",0,7,0,80.900000000000006]
["outlook 送信確認 ポップアップ",0,2,0,83.5]
["outlook 送信確認 マクロ",0,1,0,25]
["outlook 送信者 表示",0,1,0,89]
["outlook 送信者名",0,1,0,88]
["outlook 送受信 自動",0,1,0,86]
["outlook 連絡先 フォルダ",0,1,0,81]
["outlook 連絡先 並び替え 任意",0,1,0,72]
["outlook 連絡先 保存",0,1,0,88]
["outlook 連絡先 移動",0,1,0,74]
["outlook 選択したメールの数",0,1,0,43]
["outlook 配布リスト",0,14,0,56.4]
["outlook 電話メモ",0,1,0,42]
["outlook.application",0,260,0,13.4]
["outlook.application createitem",0,17,0,11.8]
["outlook.application vba excel",0,1,0,12]
["outlook.application 参照設定",0,1,0,67]
["outlook.application.createitem",0,2,0,15.5]
["outlook.attachment",0,1,0,51]
["outlook.createitem(0)",0,1,0,20]
["outlook.folder vba",0,1,0,16]
["outlook.getdefaultfolder",0,5,0,25.2]
["outlook.getdefaultfolder(6)",0,1,0,10]
["outlook.getnamespace( mapi )",0,3,0,17]
["outlook.items",0,1,0,29]
["outlook.recipient",0,5,0,75.8]
["outlook.recipient vba",0,1,0,10]
["outlook.selection",0,8,0,9.5]
["outlook2010 vba",0,2,0,16]
["outlook2010 マクロ",0,1,0,41]
["outlookアイテム",0,4,0,53.3]
["outlookアイテム 開く",0,5,0,36.200000000000003]
["outlookマクロ",0,8,0,53.3]
["overflow hidden 無視",0,6,0,89.2]
["ovpn",0,2,0,41.5]
["ovpn client",0,1,0,51]
["ovpn se",0,1,0,20]
["ovpn ファイル",0,5,0,59.6]
["ovpn ファイル 作成",0,5,0,30.8]
["ovpn 設定",0,2,0,25.5]
["ovpn.se",0,11,0,11.2]
["ovpnファイル",0,5,0,55.2]
["p1 コマンドエラー",0,4,0,35.5]
["p1コマンドエラー",0,2,0,28]
["package 'php-pgsql' has no installation candidate",0,1,0,66]
["package 'php5' has no installation candidate",0,1,0,99]
["package 'subversion' has no installation candidate",0,1,0,27]
["patch command",0,1,0,66]
["patch command options",0,1,0,9]
["patch delete",0,2,0,11]
["patch diff",0,2,0,63]
["patch file to patch",0,36,0,8.6999999999999993]
["patch folder",0,1,0,3]
["patch hunk",0,31,0,8.1]
["patch ignore whitespace",0,2,0,6]
["patch option",0,27,0,8]
["patch options",0,2,0,5.5]
["patch orig",0,2,0,8]
["patch p",0,5,0,8.8000000000000007]
["patch p0",0,1,0,86]
["patch p0 p1",0,3,0,6.3]
["patch p1",0,31,0,13.1]
["patch p1 command",0,1,0,6]
["patch path",0,1,0,6]
["patch r",0,6,0,4.7]
["patch rej",0,2,0,9]
["patch reject",0,1,0,7]
["patch reverse",0,9,0,6.2]
["patch strip",0,1,0,4]
["patch オプション",0,24,0,9.1]
["patch ディレクトリ",0,2,0,8]
["patch ファイル",0,3,0,60]
["patch 作成",0,1,0,60]
["patch 当て方",0,1,0,65]
["patch 改行コード",0,5,0,11.2]
["patch 適用",0,10,0,84.7]
["patchファイル",0,4,0,55.8]
["pdo_mysql インストール",0,6,0,70.8]
["pear 読み方",0,1,0,94]
["pecl install xdebug",0,7,0,66.7]
["pecl uninstall",0,1,0,49]
["pecl インストール",0,1,0,74]
["perl appconfig",0,1,0,26]
["perl cpan",0,4,0,92.5]
["perl cpan install",0,1,0,94]
["perl date parse",0,4,0,65.5]
["perl mcpan",0,1,0,76]
["perl mime parser",0,1,0,46]
["perl msgbox",0,1,0,85]
["perl strcmp",0,1,0,59]
["perl wget",0,2,0,26.5]
["perl zip 解凍",0,5,0,55.8]
["perl 文字列 比較",0,1,0,86]
["perl 比較演算子 文字列",0,2,0,91]
["phing install",0,1,0,73]
["php --with-mysqli",0,2,0,67]
["php 5.2.6",0,1,0,57]
["php addtype",0,2,0,71.5]
["php apache 再起動",0,1,0,71]
["php apxs2",0,2,0,23.5]
["php centos インストール",0,1,0,100]
["php common",0,1,0,81]
["php configure 追加",0,1,0,96]
["php error_log 出力されない",0,1,0,133]
["php expose_php",0,3,0,73.3]
["php imagemagick インストール",0,1,0,91]
["php ini_set memory_limit",0,8,0,70.5]
["php log_errors_max_len",0,13,0,9]
["php mb_string",0,7,0,63.6]
["php mbstring",0,1,0,88]
["php mbstring windows",0,4,0,83.8]
["php mbstring インストール",0,3,0,39.299999999999997]
["php mbstring 設定",0,1,0,97]
["php memory_limit htaccess",0,1,0,65]
["php mysqli インストール",0,10,0,71.900000000000006]
["php pgsql",0,2,0,80.5]
["php pgsql インストール",0,1,0,85]
["php postgresql インストール",0,1,0,51]
["php set ini max_execution_time",0,1,0,32]
["php smarty インストール",0,11,0,71.3]
["php strcmp",0,5,0,78.400000000000006]
["php update pdo",0,1,0,93]
["php windows インストール",0,1,0,68]
["php xdebug install",0,2,0,60]
["php xdebug インストール",0,1,0,74]
["php zip インストール",0,2,0,56.5]
["php zlib",0,1,0,82]
["php インストール",0,3,0,78.7]
["php インストール centos",0,16,0,75.099999999999994]
["php インストール windows",0,2,0,94.5]
["php ソース インストール",0,16,0,86.5]
["php パイプ",0,4,0,14.3]
["php 再起動",0,1,0,91]
["php 可変変数",0,42,0,82.1]
["php 変数名 動的",0,1,0,58]
["php 変数名 変数",0,3,0,85.3]
["php 変数名に変数",0,5,0,80]
["php 拡張モジュール インストール centos",0,1,0,86]
["php 文字列 検索",0,2,0,95]
["php 文字列 比較",0,123,0,87.7]
["php 文字列の比較",0,4,0,94]
["php 文字列検索",0,2,0,97.5]
["php 文字列比較",0,54,0,90]
["php 標準出力",0,2,0,91]
["php 正規表現 最短マッチ",0,1,0,78]
["php-common",0,6,0,78.3]
["php-devel",0,7,0,82.1]
["php-devel とは",0,3,0,65]
["php-mbstring ダウンロード",0,2,0,42]
["php-pgsql",0,3,0,88.3]
["php-pgsql yum",0,1,0,35]
["php.ini mbstring.http_input",0,1,0,95]
["php.ini memory_limit 反映されない",0,2,0,62.5]
["php.ini memory_limit 最適",0,1,0,78]
["php.ini 編集",0,3,0,77.7]
["php.ini-dist",0,3,0,72]
["php4ts.dll",0,3,0,10.7]
["php5 mbstring",0,1,0,41]
["php5 インストール",0,3,0,58.3]
["php5-mbstring",0,2,0,48.5]
["php5.1",0,1,0,96]
["php5.2",0,13,0,79.8]
["php_mbstring.dll",0,2,0,89.5]
["php_value display_errors",0,3,0,43.7]
["php_value display_errors 1",0,1,0,45]
["php_value upload_max_filesize",0,3,0,94.7]
["phpmyadmin memory limit",0,1,0,43]
["phppgadmin インストール",0,1,0,94]
["phppgadmin 使い方",0,29,0,51.4]
["poderosa download",0,1,0,30]
["poderosa ssh",0,4,0,90.5]
["poderosa インストール",0,18,0,49.7]
["poderosa ダウンロード",0,78,0,74.599999999999994]
["postfix",0,1,0,122]
["postfix /etc/hosts",0,1,0,46]
["postfix alternatives",0,1,0,84]
["postfix centos",0,1,0,19]
["postfix conf",0,1,0,91]
["postfix firewall",0,1,0,93]
["postfix hosts",0,1,0,33]
["postfix imap",0,5,0,36.4]
["postfix iptables",0,2,0,57.5]
["postfix ipアドレス",0,1,0,100]
["postfix localhost",0,2,0,75.5]
["postfix maildir",0,5,0,72.400000000000006]
["postfix mydestination",0,8,0,83]
["postfix myhostname",0,6,0,85.7]
["postfix mynetworks",0,1,0,96]
["postfix pop",0,14,0,66.2]
["postfix pop3",0,16,0,64.8]
["postfix reload",0,4,0,75]
["postfix reload restart 違い",0,1,0,63]
["postfix reload 影響",0,4,0,43.5]
["postfix restart",0,8,0,45.8]
["postfix stop",0,1,0,92]
["postfix virtual",0,1,0,93]
["postfix virtual_alias_domains",0,2,0,67.5]
["postfix webメール",0,1,0,38]
["postfix windows インストール",0,2,0,35.5]
["postfix インストール",0,9,0,89.4]
["postfix サブドメイン",0,2,0,81.5]
["postfix スパム対策",0,6,0,91.8]
["postfix ドメイン",0,1,0,162]
["postfix メールアドレス 追加",0,1,0,72]
["postfix 停止",0,6,0,59.8]
["postfix 再起動",0,5,0,57.2]
["postfix 名前解決",0,3,0,62.7]
["postfix 文字化け",0,1,0,79]
["postfix 構築",0,55,0,74]
["postfix 移行",0,4,0,85.5]
["postfix 自動起動",0,1,0,74]
["postfix 自動返信",0,2,0,116]
["postfix 起動",0,9,0,68.2]
["postgres null 判定",0,1,0,92]
["postgres windows インストール",0,2,0,99]
["postgres インストール windows",0,1,0,97]
["postgres パスワード 初期値",0,2,0,41.5]
["postgres パスワード 変更 windows",0,1,0,92]
["postgres 使い方",0,12,0,74.5]
["postgres 再起動",0,1,0,99]
["postgres 正規表現",0,1,0,86]
["postgresql 10 インストール centos",0,1,0,95]
["postgresql 11 インストール windows",0,4,0,66.3]
["postgresql dblink install",0,1,0,92]
["postgresql dblink インストール",0,6,0,67.2]
["postgresql windows インストール",0,1,0,92]
["postgresql yum",0,1,0,87]
["postgresql インストール",0,1,0,73]
["postgresql インストール centos",0,1,0,96]
["postgresql インストール linux",0,2,0,94.5]
["postgresql インストール windows",0,1,0,87]
["postgresql サービス名",0,1,0,50]
["postgresql ダウンロード linux",0,1,0,97]
["postgresql 使い方 linux",0,6,0,64]
["postgresql 再起動 linux",0,3,0,32.700000000000003]
["postgresql 初期設定 windows",0,1,0,90]
["postgresql 起動",0,1,0,96]
["postgresql 起動 linux",0,1,0,35]
["postgressql",0,2,0,63]
["preg_match テスト",0,2,0,98]
["preg_match 改行",0,7,0,95.4]
["propel sql",0,1,0,7]
["propel symfony",0,1,0,48]
["psql -c 使い方",0,1,0,85]
["putty",0,1,0,70]
["putty 0.70 日本語",0,8,0,8.5]
["putty download",0,14,0,67.599999999999994]
["putty download 日本語",0,30,0,9]
["putty flex",0,1,0,4]
["putty jp",0,134,0,10.199999999999999]
["putty mac 使い方",0,2,0,55.5]
["putty patch",0,1,0,14]
["putty vector",0,44,0,9]
["putty zip",0,3,0,23.3]
["putty インストール",0,41,0,45.3]
["putty コピー",0,3,0,73.7]
["putty タブ",0,3,0,69]
["putty ダウンロード",0,60,0,71.8]
["putty ダウンロード 窓の杜",0,98,0,9.5]
["putty 日本語 64bit",0,1,0,20]
["putty 日本語版 ダウンロード",0,1,0,10]
["putty 日本語表示",0,2,0,15.5]
["putty 設定",0,13,0,89.6]
["putty-jp",0,2,0,9]
["puttyp",0,1,0,21]
["python rpm インストール",0,3,0,88.3]
["qkc",0,1,0,69]
["quickform",0,5,0,33.6]
["recipients vba",0,1,0,78]
["recipients.add vba",0,1,0,16]
["redhat ftp 設定",0,1,0,89]
["redhat vnc",0,1,0,100]
["redhat yum リポジトリ url",0,7,0,82.3]
["redhat yum 使えない",0,1,0,91]
["redhat yum 設定",0,1,0,92]
["redim 意味",0,1,0,77]
["rediris.es",0,1,0,8]
["releasever yum",0,4,0,96]
["remember to create new partitions",0,2,0,9]
["remember to create new partitions.",0,3,0,5.7]
["resolv-retry openvpn",0,1,0,6]
["rhel base repo",0,1,0,48]
["rhel zip 解凍",0,2,0,65.5]
["rhel リポジトリ ミラー",0,1,0,92]
["riken centos",0,2,0,80.5]
["riken ftp",0,4,0,93.8]
["rm -rf コマンド",0,5,0,94.8]
["rm アスタリスク",0,2,0,59.5]
["rm コマンド",0,30,0,94.8]
["rm コマンド 正規表現",0,1,0,90]
["rmコマンド",0,5,0,95.4]
["rmコマンド 失敗",0,2,0,88]
["rpm dependency check",0,1,0,69]
["rpmnew",0,5,0,52.8]
["save as vba",0,1,0,80]
["saveasfile vba",0,2,0,18]
["selection.find vba",0,1,0,74]
["send key vba",0,2,0,63.5]
["sendkeys excel vba",0,1,0,77]
["sendkeys vba",0,47,0,75.3]
["sendkeys vba 一覧",0,1,0,58]
["sendmail postfix 移行",0,13,0,71.5]
["sendmail キュー",0,11,0,54.8]
["sentonbehalfofname outlook",0,1,0,9]
["sentonbehalfofname vba",0,51,0,9.8000000000000007]
["servertokens none",0,1,0,42]
["session.getdefaultfolder",0,4,0,37.5]
["set vba",0,24,0,61.6]
["set マクロ",0,3,0,72.3]
["setenvif request_uri",0,9,0,88.7]
["setenvif 複数",0,1,0,73]
["setenvifnocase request_uri",0,2,0,96]
["sh901ic",0,1,0,63]
["show vba",0,1,0,66]
["simpletest",0,4,0,53.5]
["smarty ants password",0,1,0,5]
["smarty assign",0,3,0,83]
["smarty assign 変数",0,3,0,56.7]
["smarty download",0,1,0,89]
["smarty dreamweaver",0,6,0,35.5]
["smarty empty 判定",0,2,0,41.5]
["smarty for",0,1,0,50]
["smarty null 判定",0,6,0,45.2]
["smarty number_format",0,19,0,76.3]
["smarty php 変数",0,2,0,58]
["smarty sql",0,1,0,94]
["smarty sum",0,2,0,13]
["smarty インストール",0,43,0,62.7]
["smarty コメント",0,13,0,69.8]
["smarty ダウンロード",0,14,0,76.400000000000006]
["smarty 変数",0,79,0,72.400000000000006]
["smarty 変数 定義",0,2,0,46]
["smarty 変数 表示",0,3,0,81.7]
["smarty 文字列 検索",0,6,0,51]
["smarty 文字列 比較",0,1,0,38]
["smarty 正規表現",0,14,0,71.400000000000006]
["smarty 比較",0,1,0,108]
["smarty 比較演算子",0,3,0,65.7]
["smtp over ssl postfix",0,1,0,100]
["smtpサーバ 構築",0,1,0,83]
["solaris tar",0,1,0,95]
["solaris tar 解凍",0,1,0,91]
["solaris zip",0,22,0,74.599999999999994]
["somenet",0,2,0,10]
["sotarok",0,5,0,67.400000000000006]
["strcmp php",0,7,0,82.1]
["strip コマンド",0,2,0,81]
["stripコマンド",0,1,0,91]
["studentenweb",0,1,0,76]
["su postgres",0,1,0,70]
["sub vba",0,2,0,68]
["subversion linux インストール",0,17,0,85.2]
["subversion rpm",0,1,0,65]
["subversion trac",0,2,0,89]
["subversion インストール linux",0,2,0,87.5]
["subversion 日本語化",0,4,0,74]
["subversion 権限",0,1,0,77]
["svn linux インストール",0,1,0,73]
["svn trac",0,1,0,88]
["svn yum",0,1,0,97]
["svn インストール",0,4,0,72.3]
["svn チェックアウト タイムアウト",0,1,0,84]
["svn パッチ",0,6,0,87.3]
["swc flash",0,1,0,41]
["swf player games",0,1,0,18]
["swf ゲーム",0,1,0,72]
["swf ダウンロードされる",0,1,0,75]
["swf 作成方法",0,1,0,94]
["swf 解凍",0,1,0,97]
["symfony 4.4",0,1,0,55]
["symfony init",0,1,0,22]
["symfony install",0,1,0,99]
["symfony mysql",0,1,0,74]
["symfony propel",0,3,0,42.3]
["symfony sql",0,4,0,70.8]
["symfony utf8",0,2,0,9]
["symfony インストール",0,23,0,62.4]
["symfony4 インストール",0,3,0,79]
["symfonyとは",0,2,0,85]
["tar compress",0,7,0,57.6]
["tar compress tgz",0,1,0,36]
["tar exclude ディレクトリ",0,1,0,97]
["tar exclude 効かない",0,3,0,71.7]
["tar gz tgz",0,1,0,21]
["tar gz zip",0,2,0,72.5]
["tar gz 圧縮",0,2,0,87.5]
["tar gz 圧縮 ディレクトリ",0,9,0,91.1]
["tar gz 展開",0,9,0,72.599999999999994]
["tar gz 解凍",0,3,0,87.7]
["tar gz 解凍 linux",0,2,0,93]
["tar linux",0,1,0,94]
["tar linux zip",0,1,0,10]
["tar linux コマンド",0,2,0,96]
["tar owner",0,3,0,47.3]
["tar permission",0,18,0,15.8]
["tar tar",0,1,0,94]
["tar tar.gz",0,1,0,45]
["tar tgz",0,7,0,66.599999999999994]
["tar tgz 解凍",0,4,0,61.5]
["tar z",0,13,0,51.9]
["tar zcvf",0,82,0,83.4]
["tar zcvf コマンド",0,1,0,95]
["tar zip",0,19,0,61.3]
["tar zip コマンド",0,5,0,72.400000000000006]
["tar zip 解凍",0,6,0,93.8]
["tar zvcf",0,3,0,76.3]
["tar zxvf",0,7,0,80.400000000000006]
["tar zxvf -c",0,1,0,13]
["tar zxvf 解凍",0,1,0,98]
["tar とは",0,19,0,76.7]
["tar コマンド zip",0,1,0,58]
["tar コマンド パーミッション",0,1,0,37]
["tar コマンド 圧縮",0,1,0,93]
["tar コマンド 除外",0,1,0,94]
["tar テスト",0,5,0,45.4]
["tar ディレクトリ 除外",0,11,0,75.599999999999994]
["tar パス 含めない",0,4,0,61.5]
["tar パーミッション",0,163,0,11.9]
["tar パーミッション 保持しない",0,1,0,13]
["tar パーミッション 指定",0,1,0,16]
["tar フォルダ 圧縮",0,2,0,86]
["tar フォルダ 除外",0,1,0,42]
["tar 固める",0,16,0,52.4]
["tar 固める ディレクトリ",0,2,0,59]
["tar 圧縮 コマンド",0,2,0,99]
["tar 圧縮 パーミッション",0,5,0,10]
["tar 圧縮 権限",0,2,0,6]
["tar 圧縮 除外",0,8,0,63.6]
["tar 展開",0,2,0,72]
["tar 展開 パーミッション",0,3,0,19.7]
["tar 所有者",0,4,0,31]
["tar 権限",0,37,0,15.5]
["tar 権限 保持",0,30,0,9.3000000000000007]
["tar 正規表現",0,5,0,39.4]
["tar 解凍",0,3,0,75.3]
["tar 解凍 linux",0,1,0,92]
["tar 解凍 パーミッション",0,13,0,11.8]
["tar 解凍 所有者",0,7,0,18.399999999999999]
["tar 解凍 権限",0,7,0,12]
["tar 除外",0,85,0,77.599999999999994]
["tar.gz tgz",0,5,0,33.200000000000003]
["tar.gz windows 圧縮",0,1,0,91]
["tar.gz zip",0,1,0,93]
["tar.gz zip 違い",0,2,0,68.5]
["tar.gz 圧縮 linux",0,1,0,100]
["tar.gz 圧縮 コマンド",0,1,0,81]
["tar.gz 展開",0,14,0,56.8]
["tar.gz 解凍",0,3,0,81.7]
["tar.gz 解凍 linux",0,3,0,90.7]
["tar.gz 解答",0,1,0,94]
["tar.z",0,6,0,44.2]
["tar.z 解凍",0,2,0,80]
["tarz",0,6,0,29.5]
["tarで固める",0,3,0,73]
["tarとは",0,13,0,74.8]
["tarファイル 展開",0,1,0,73]
["taz 解凍",0,24,0,15.3]
["tcp 5901",0,4,0,24]
["tdm400p",0,1,0,20]
["tgz",0,16,0,61.8]
["tgz compress",0,1,0,4]
["tgz tar",0,3,0,77.7]
["tgz tar.gz",0,5,0,21.2]
["tgz ファイル 解凍",0,117,0,74.3]
["tgz 回答",0,2,0,68]
["tgz 圧縮",0,18,0,75.599999999999994]
["tgz 圧縮 linux",0,1,0,79]
["tgz 展開",0,25,0,54.8]
["tgz 解凍",0,209,0,75]
["tgz 解凍 linux",0,39,0,93.3]
["tgz 解凍 windows コマンド",0,2,0,95.5]
["tgzファイル",0,55,0,77]
["tgzファイル 解凍",0,13,0,81.099999999999994]
["timer vba",0,1,0,88]
["timer() vba",0,2,0,39]
["total uninstall 2.35",0,2,0,43]
["trac install",0,3,0,83]
["trac linux",0,2,0,32.5]
["trac python",0,1,0,58]
["trac subversion",0,3,0,92.3]
["trac svn",0,1,0,88]
["trac インストール",0,10,0,84]
["trac 日本語",0,1,0,49]
["typename vba",0,5,0,71.8]
["typeof == undefined",0,1,0,60]
["un tar linux",0,1,0,47]
["undefined javascript",0,2,0,70.5]
["undefined javascript 判定",0,28,0,46.6]
["undefined null javascript 判定",0,2,0,53]
["undefined null 判定",0,1,0,51]
["undefined object",0,4,0,25.3]
["undefined チェック",0,3,0,55]
["undefined 判定",0,25,0,46.8]
["undefined 判定 javascript",0,3,0,48.3]
["undefined==null",0,1,0,49]
["undefinedはオブジェクトではありません",0,2,0,72]
["unified diff",0,4,0,85.3]
["unified形式",0,1,0,62]
["unix dd コマンド 使い方",0,1,0,62]
["unix tar.gz 解凍",0,1,0,100]
["unix zip",0,1,0,90]
["unix zip コマンド",0,18,0,93.5]
["unix zip 圧縮",0,22,0,84.7]
["unix zip 解凍",0,4,0,93.3]
["unix コマンド zip",0,2,0,92.5]
["unset session_manager",0,1,0,13]
["upload_max_filesize ini_set",0,2,0,88]
["utc8時",0,2,0,84.5]
["variant vba",0,2,0,69]
["variant 意味 vba",0,1,0,91]
["vb outlook",0,1,0,41]
["vb sendkeys",0,1,0,84]
["vb6 sendkeys",0,1,0,56]
["vb6 メール送信",0,8,0,61.4]
["vba #1 意味",0,1,0,61]
["vba & 使い方",0,1,0,60]
["vba .display",0,3,0,11.3]
["vba 2007",0,1,0,83]
["vba access outlook",0,1,0,18]
["vba active application",0,2,0,81]
["vba activeinspector",0,3,0,23]
["vba address",0,3,0,62]
["vba application",0,7,0,62.9]
["vba application sendkeys",0,1,0,31]
["vba application.",0,1,0,58]
["vba application.find",0,2,0,40]
["vba application.sendkeys",0,2,0,66]
["vba application.text",0,1,0,60]
["vba as integer",0,2,0,74.5]
["vba attachments",0,1,0,19]
["vba body",0,1,0,38]
["vba book save",0,1,0,85]
["vba cdo メール受信",0,2,0,40.5]
["vba close #1",0,3,0,41]
["vba const",0,2,0,93.5]
["vba count",0,16,0,74.3]
["vba create object",0,2,0,80]
["vba createitem",0,6,0,12.7]
["vba createobject",0,1,0,93]
["vba createobject outlook",0,2,0,9.5]
["vba createobject( outlook.application )",0,6,0,10.7]
["vba createobject(\"outlook.application\")",0,6,0,10.8]
["vba delete",0,18,0,79.099999999999994]
["vba dim",0,12,0,63]
["vba dim %",0,1,0,54]
["vba dim set",0,5,0,62.6]
["vba dim 意味",0,1,0,58]
["vba display",0,5,0,15.4]
["vba doevents 使い方",0,1,0,72]
["vba email",0,1,0,54]
["vba email send",0,1,0,36]
["vba end",0,27,0,72.900000000000006]
["vba end for",0,1,0,55]
["vba end sub",0,7,0,74.099999999999994]
["vba endsub",0,1,0,71]
["vba excel outlook",0,3,0,58]
["vba file delete",0,1,0,69]
["vba file open",0,3,0,91.7]
["vba file save",0,1,0,97]
["vba find",0,268,0,75.7]
["vba find count",0,1,0,23]
["vba find findnext",0,20,0,81.8]
["vba find next",0,25,0,71.3]
["vba find nothing",0,1,0,87]
["vba find nothingになる",0,3,0,61.7]
["vba find what",0,5,0,77]
["vba find あるのにnothing",0,1,0,66]
["vba find ないとき",0,1,0,64]
["vba find ループ",0,1,0,46]
["vba find 使い方",0,22,0,52.3]
["vba find 正規表現",0,1,0,69]
["vba find 複数",0,24,0,53.6]
["vba findnext",0,51,0,79.099999999999994]
["vba findnext loop",0,1,0,98]
["vba findnext nothing",0,1,0,81]
["vba findnext 複数条件",0,2,0,69.5]
["vba firefox",0,1,0,83]
["vba folder",0,18,0,74.8]
["vba folder 作成",0,1,0,62]
["vba folders",0,2,0,67]
["vba for count",0,1,0,71]
["vba for end",0,5,0,50.6]
["vba for next",0,16,0,84.8]
["vba found",0,1,0,85]
["vba getnamespace",0,7,0,12.9]
["vba getobject outlook",0,5,0,16.399999999999999]
["vba getshareddefaultfolder",0,3,0,15.3]
["vba gz 解凍",0,1,0,36]
["vba gzip",0,4,0,16.8]
["vba inputbox",0,4,0,97.5]
["vba inputbox 複数",0,14,0,57.6]
["vba item",0,28,0,62]
["vba items",0,6,0,24]
["vba mail",0,3,0,75.7]
["vba mail 送信",0,1,0,48]
["vba mailitem",0,11,0,48]
["vba me-ru",0,1,0,70]
["vba move",0,4,0,64.5]
["vba move file",0,1,0,62]
["vba msg",0,6,0,81]
["vba msgbox ボタン 任意",0,6,0,81.8]
["vba msgbox 入力",0,34,0,93]
["vba msgbox 自動で閉じる",0,2,0,79.5]
["vba msgbox 複数",0,2,0,73]
["vba new",0,3,0,69.3]
["vba next for",0,1,0,84]
["vba olmailitem",0,2,0,16.5]
["vba open #1",0,1,0,59]
["vba open outlook",0,1,0,7]
["vba opentext",0,3,0,89.7]
["vba outlook application",0,8,0,19]
["vba outlook attachments.add",0,1,0,24]
["vba outlook body",0,2,0,57.5]
["vba outlook calendar",0,1,0,17]
["vba outlook createitem",0,22,0,11.5]
["vba outlook excel",0,2,0,54.5]
["vba outlook find email by subject",0,1,0,16]
["vba outlook folder",0,1,0,31]
["vba outlook from",0,3,0,23]
["vba outlook html",0,6,0,28]
["vba outlook item",0,14,0,9.8000000000000007]
["vba outlook items",0,7,0,11]
["vba outlook mail",0,1,0,32]
["vba outlook mailitem",0,4,0,36.799999999999997]
["vba outlook msgbox",0,1,0,8]
["vba outlook recipients",0,2,0,19]
["vba outlook save email to folder",0,1,0,10]
["vba outlook session",0,1,0,18]
["vba outlook subject",0,1,0,32]
["vba outlook アドレス帳 取得",0,1,0,20]
["vba outlook フォルダ指定",0,3,0,28]
["vba outlook メール",0,2,0,46.5]
["vba outlook メール作成",0,40,0,49]
["vba outlook メール取得",0,9,0,42.2]
["vba outlook メール送信",0,41,0,34.1]
["vba outlook 予定表",0,11,0,28.6]
["vba outlook 予定表 取得",0,4,0,39.299999999999997]
["vba outlook 予定表 登録",0,1,0,17]
["vba outlook 勝手に起動",0,3,0,34.700000000000003]
["vba outlook 参照設定",0,1,0,72]
["vba outlook 宛先 複数",0,1,0,50]
["vba outlook 本文",0,2,0,42]
["vba outlook 検索",0,1,0,28]
["vba outlook 添付ファイル",0,32,0,35.5]
["vba outlook 添付ファイル 保存",0,11,0,27.9]
["vba outlook 添付ファイル 複数",0,2,0,33.5]
["vba outlook 送信",0,4,0,24]
["vba outlook 連絡先 フォルダ削除",0,3,0,8]
["vba outlook.application",0,68,0,10.1]
["vba outlook.mailitem",0,1,0,28]
["vba print",0,4,0,73]
["vba print #1",0,9,0,63.1]
["vba recipient",0,2,0,10]
["vba recipients",0,5,0,29.2]
["vba recipients.add",0,5,0,23.6]
["vba redim",0,1,0,99]
["vba save",0,8,0,75.599999999999994]
["vba saveas",0,1,0,92]
["vba saveasfile",0,3,0,17]
["vba search",0,1,0,79]
["vba selection.find",0,1,0,79]
["vba sendkey",0,22,0,75.7]
["vba sendkeys",0,54,0,74.900000000000006]
["vba sendkeys delete",0,1,0,47]
["vba sendkeys 一覧",0,31,0,71.400000000000006]
["vba set",0,237,0,63.5]
["vba set dim",0,1,0,93]
["vba set find",0,3,0,74]
["vba set new",0,2,0,46]
["vba set selection",0,1,0,33]
["vba set with",0,1,0,75]
["vba set とは",0,1,0,50]
["vba set 使い方",0,6,0,41.8]
["vba set 意味",0,2,0,61.5]
["vba start timer",0,1,0,76]
["vba sub",0,11,0,68.5]
["vba sub end",0,1,0,67]
["vba timer",0,3,0,95]
["vba txt 開く",0,1,0,84]
["vba typename",0,27,0,70.2]
["vba url 開く",0,3,0,74]
["vba variant",0,2,0,76.5]
["vba variant count",0,1,0,28]
["vba variant redim",0,1,0,48]
["vba write",0,1,0,84]
["vba write print",0,1,0,66]
["vba ふぃんｄ",0,2,0,54.5]
["vba アウトルック",0,6,0,43.3]
["vba アウトルック メール作成",0,1,0,41]
["vba アドレス",0,2,0,87]
["vba アプリケーション",0,5,0,69.8]
["vba アプリケーション アクティブ",0,1,0,69]
["vba アプリケーション 終了",0,4,0,94.8]
["vba アラート",0,24,0,81.400000000000006]
["vba エクスプローラ",0,1,0,98]
["vba エクスプローラ フォルダ 閉じる",0,1,0,50]
["vba エクスプローラ 開く",0,3,0,68.7]
["vba カウント",0,1,0,83]
["vba コメント",0,1,0,100]
["vba コメント 削除",0,3,0,99]
["vba コメント 編集",0,1,0,88]
["vba コメント 表示",0,4,0,60.3]
["vba コメント 追加",0,3,0,78.7]
["vba コンスタント",0,1,0,47]
["vba スケジュール",0,1,0,93]
["vba スタイル 削除",0,1,0,93]
["vba タイマー",0,6,0,96.8]
["vba ダイアログ 入力",0,3,0,93.7]
["vba テキスト 保存",0,3,0,97.7]
["vba テキストファイル 開いているか 確認",0,4,0,70.8]
["vba テキスト保存",0,4,0,85.5]
["vba ディレクトリ",0,1,0,91]
["vba ディレクトリ 削除",0,2,0,60.5]
["vba ディレクトリ 移動",0,1,0,72]
["vba ディレクトリ削除",0,1,0,65]
["vba ファイル リネーム",0,5,0,81]
["vba ファイル 削除",0,2,0,93]
["vba ファイル 移動",0,8,0,85.3]
["vba ファイルが開くまで待つ",0,1,0,69]
["vba ファイルの移動",0,1,0,88]
["vba ファイルリネーム",0,1,0,84]
["vba ファイル削除",0,6,0,93]
["vba ファイル移動",0,11,0,85.5]
["vba フォルダ を 開く",0,1,0,92]
["vba フォルダ 作成",0,24,0,85.7]
["vba フォルダ 削除",0,26,0,68.2]
["vba フォルダ 移動",0,6,0,72]
["vba フォルダ 選択",0,2,0,94.5]
["vba フォルダ 閉じる",0,1,0,79]
["vba フォルダ 開く",0,5,0,83.6]
["vba フォルダの削除",0,3,0,72.3]
["vba フォルダの移動",0,2,0,74.5]
["vba フォルダー削除",0,2,0,76.5]
["vba フォルダ作成",0,19,0,90.7]
["vba フォルダ作成 複数",0,1,0,100]
["vba フォルダ削除",0,37,0,66.099999999999994]
["vba フォルダ移動",0,26,0,66]
["vba フォルダ開く",0,1,0,81]
["vba メッセージ",0,23,0,85]
["vba メッセージボックス 自動で閉じる",0,1,0,80]
["vba メッセージボックス 自動的に閉じる",0,3,0,72.3]
["vba メッセージ表示",0,2,0,94.5]
["vba メール",0,74,0,60.2]
["vba メール 作成",0,26,0,64.2]
["vba メール 作成 表 挿入",0,1,0,45]
["vba メール 差出人",0,1,0,31]
["vba メール 添付",0,8,0,56.5]
["vba メール 添付 複数",0,6,0,57.2]
["vba メール 添付ファイル",0,7,0,55.7]
["vba メール 送信",0,37,0,67.7]
["vba メール作成",0,31,0,68]
["vba メール作成 宛先 複数",0,15,0,50.3]
["vba メール作成 本文",0,10,0,66.099999999999994]
["vba メール作成 添付ファイル",0,1,0,42]
["vba メール受信",0,42,0,45.8]
["vba メール本文 取得",0,1,0,74]
["vba メール送信",0,110,0,70.599999999999994]
["vba メール送信 添付ファイル",0,3,0,64]
["vba リスト 作成",0,4,0,84.8]
["vba 一括コメント",0,3,0,87.3]
["vba 保存 ダイアログ",0,3,0,93.3]
["vba 保存ダイアログ",0,1,0,96]
["vba 保存先フォルダ指定",0,1,0,92]
["vba 入力ダイアログ",0,3,0,80.7]
["vba 入力ボックス",0,3,0,85.7]
["vba 入力ボックス 複数",0,8,0,56.9]
["vba 削除 ファイル",0,1,0,91]
["vba 名前 削除",0,1,0,88]
["vba 定数",0,2,0,87]
["vba 定数クラス",0,1,0,66]
["vba 実行中 メッセージ",0,3,0,87.7]
["vba 新規",0,2,0,42]
["vba 新規作成",0,1,0,85]
["vba 書き込み",0,1,0,89]
["vba 添付ファイル",0,5,0,48.4]
["vba 添付ファイル 保存",0,1,0,55]
["vba 確認ダイアログ",0,3,0,82]
["vba 秒後に実行",0,2,0,95]
["vba 配列 カウント",0,1,0,93]
["vba 閉じるときに実行",0,1,0,96]
["vba 開く",0,3,0,87.7]
["vba-m 使い方",0,4,0,54]
["vba-m 設定",0,1,0,88]
["vbbinarycompare",0,3,0,57.3]
["vbs excel 開く",0,1,0,64]
["vbs msgbox タイトル",0,1,0,98]
["vbs msgbox 表示されない",0,1,0,99]
["vbs outlook",0,1,0,30]
["vbs outlook メール作成",0,9,0,26.6]
["vbs outlook メール送信",0,3,0,23.3]
["vbs outlook.application",0,4,0,23.3]
["vbs shellexecute 引数",0,3,0,79.3]
["vbs フォルダ移動",0,1,0,90]
["vbs メール作成",0,1,0,69]
["vbs メール受信",0,1,0,67]
["vbs メール送信 outlook",0,3,0,25.7]
["vbs メール送信 添付ファイル 複数",0,1,0,97]
["vbs メール送信 複数宛先",0,1,0,86]
["vbscript outlook",0,6,0,40.200000000000003]
["vbscript outlook.application",0,3,0,12.7]
["vector 日本語化",0,1,0,19]
["vgzh",0,2,0,73.5]
["virtual_alias_domains",0,1,0,76]
["visualboyadvance-m 設定",0,1,0,71]
["vnc geometry",0,2,0,97.5]
["vnc root",0,8,0,72.3]
["vnc xstartup",0,21,0,76.400000000000006]
["vnc インストール",0,1,0,91]
["vnc ディスプレイ番号",0,2,0,63.5]
["vnc/xstartup",0,2,0,79.5]
["vncserver geometry xstartup",0,1,0,70]
["vncserver gnome-session",0,1,0,89]
["vncserver rpm",0,1,0,93]
["vncserver xstartup",0,2,0,86.5]
["vncserver 設定",0,1,0,97]
["vncserverargs",0,1,0,16]
["wget for windows",0,35,0,65.900000000000006]
["wget install windows",0,1,0,10]
["wget perl",0,2,0,38.5]
["wget windows",0,176,0,70.3]
["wget windows コマンド",0,1,0,81]
["wget windows ダウンロード",0,9,0,61.7]
["wget インストール windows",0,2,0,68]
["wget フォルダ",0,6,0,43.8]
["wget 正規表現",0,2,0,14]
["wget 認証",0,20,0,57]
["windows 2008 日本語化",0,2,0,72.5]
["windows apache postgresql php",0,1,0,36]
["windows diff コマンド フォルダ",0,3,0,71.3]
["windows php mbstring",0,2,0,45]
["windows php インストール",0,15,0,82.9]
["windows postgresql インストール",0,2,0,96]
["windows wget",0,108,0,68.5]
["windows wget インストール",0,3,0,60.3]
["windows xp vnc",0,1,0,75]
["windows メールサーバー 構築",0,1,0,128]
["winscp putty 設定",0,1,0,51]
["winscp インストール",0,1,0,141]
["winscp シンボリックリンク",0,1,0,72]
["winscp 日本語 ダウンロード",0,1,0,86]
["winscp 日本語化",0,35,0,45.7]
["winscp 検索",0,1,0,94]
["winscp 窓の杜",0,19,0,72.8]
["winwget",0,9,0,11.6]
["with-apxs2",0,23,0,13.6]
["wysiwyg編集",0,2,0,98.5]
["x-lite 200",0,1,0,19]
["x-lite 設定",0,2,0,37]
["xdebug",0,1,0,67]
["xdebug ini",0,1,0,66]
["xdebug install",0,3,0,68.3]
["xdebug インストール",0,26,0,61.7]
["xdebug インストール centos7",0,1,0,92]
["xdebug 設定",0,1,0,70]
["xdebug.ini",0,1,0,91]
["xdebug.ini location",0,1,0,47]
["xdebug.so 場所",0,3,0,49.7]
["xen html 使い方",0,2,0,82.5]
["xen 使い方",0,16,0,75.5]
["xen3",0,6,0,12.3]
["xsetroot",0,1,0,83]
["xstartup",0,5,0,58.6]
["xstartup geometry",0,1,0,39]
["you don't have any linux partitions",0,1,0,40]
["youtube mp3 アップロード",0,19,0,94.5]
["youtube mp3アップロード",0,1,0,98]
["youtube アップロード",0,1,0,88]
["yum cache clean",0,1,0,66]
["yum cache search",0,2,0,80.5]
["yum cache 削除",0,1,0,88]
["yum check",0,1,0,87]
["yum check update",0,2,0,89]
["yum check-update",0,4,0,95.8]
["yum clean",0,24,0,80.599999999999994]
["yum clean all",0,1,0,87]
["yum clean all とは",0,1,0,97]
["yum clear",0,1,0,72]
["yum clear cache",0,2,0,64]
["yum extender",0,2,0,18]
["yum install apxs",0,1,0,17]
["yum install nslookup",0,1,0,40]
["yum install php-pgsql",0,1,0,49]
["yum install postfix",0,5,0,67.8]
["yum install subversion",0,2,0,51]
["yum install オプション y",0,1,0,54]
["yum list updates",0,59,0,84.6]
["yum nslookup",0,4,0,83]
["yum remove python",0,1,0,85]
["yum subversion",0,2,0,79]
["yum svn",0,1,0,62]
["yum update cache",0,1,0,75]
["yum update exclude",0,1,0,95]
["yum update list",0,1,0,85]
["yum update バージョン指定",0,1,0,93]
["yum update パッケージ指定",0,5,0,55]
["yum update 確認",0,10,0,75.599999999999994]
["yum update 除外",0,7,0,88.4]
["yum updatedb",0,1,0,84]
["yum version 指定",0,1,0,99]
["yum vim",0,1,0,94]
["yum y オプション",0,9,0,83.8]
["yum yオプション",0,2,0,84.5]
["yum zlib",0,1,0,74]
["yum アップデート可能なパッケージ",0,1,0,39]
["yum インストール可能なバージョン",0,1,0,44]
["yum インストール可能なパッケージ",0,2,0,47.5]
["yum インストール済み",0,15,0,96.9]
["yum インストール済み パッケージ 一覧",0,1,0,51]
["yum インストール済み 一覧",0,12,0,65.8]
["yum インストール済み 確認",0,53,0,55.2]
["yum オプション y",0,8,0,62.6]
["yum オプション 一覧",0,1,0,84]
["yum キャッシュ",0,4,0,83.8]
["yum キャッシュ 削除",0,2,0,97]
["yum コマンド",0,4,0,105.5]
["yum コマンド インストール",0,1,0,98]
["yum コマンド オプション",0,5,0,85.6]
["yum コマンド 一覧",0,14,0,70.900000000000006]
["yum コマンド 確認",0,1,0,77]
["yum サービス 再起動",0,1,0,35]
["yum ダウンロード のみ",0,1,0,65]
["yum ダウンロードのみ",0,2,0,88]
["yum パッケージ 一覧",0,3,0,95]
["yum パッケージ 依存関係 確認",0,1,0,91]
["yum パッケージ 検索",0,1,0,95]
["yum パッケージ 確認",0,2,0,92.5]
["yum パッケージ一覧",0,2,0,88]
["yum リポジトリ とは",0,1,0,99]
["yum リポジトリ キャッシュ 削除",0,5,0,91.6]
["yum リポジトリ 指定",0,2,0,93]
["yum 一覧",0,1,0,97]
["yum 一覧 インストール済み",0,5,0,88.2]
["yum 一覧表示",0,1,0,92]
["yum 使えるようにする",0,1,0,44]
["yum 依存 確認",0,1,0,81]
["yum 依存パッケージ 確認",0,1,0,83]
["yum 依存関係 ダウンロード",0,1,0,30]
["yum 依存関係 一覧",0,1,0,92]
["yum 依存関係 確認",0,12,0,55.3]
["yum 依存関係 表示",0,5,0,54.4]
["yum 依存関係 調査",0,2,0,34]
["yum 再インストール",0,11,0,62]
["yum 削除 コマンド",0,2,0,96.5]
["yum 接続先",0,1,0,45]
["yum 確認",0,3,0,89.3]
["yum-plugin-fastestmirror",0,1,0,81]
["z ファイル 解凍",0,1,0,95]
["z 解凍",0,10,0,58.7]
["zcat dd",0,2,0,4.5]
["zcat 行数",0,1,0,68]
["zcvf",0,8,0,48.8]
["zip -r コマンド",0,1,0,84]
["zip command exclude directory",0,1,0,94]
["zip gzip 違い",0,2,0,83.5]
["zip komando",0,1,0,81]
["zip linux",0,4,0,60.8]
["zip linux コマンド",0,16,0,75.400000000000006]
["zip linux 圧縮",0,93,0,57.5]
["zip linux 解凍",0,72,0,84.1]
["zip tar",0,19,0,8]
["zip tar linux",0,1,0,10]
["zip tar.gz linux",0,1,0,76]
["zip コマンド",0,10,0,86]
["zip コマンド linux",0,53,0,74.8]
["zip コマンド ディレクトリ 含めない",0,11,0,57.7]
["zip コマンド ディレクトリ 除外",0,1,0,40]
["zip コマンド 解凍",0,2,0,96]
["zip コマンド 除外",0,7,0,21.1]
["zip フォルダ linux",0,2,0,59]
["zip 回答 linux",0,1,0,81]
["zip 圧縮 linux",0,56,0,69.599999999999994]
["zip 圧縮 コマンド linux",0,3,0,98.7]
["zip 展開 linux",0,1,0,78]
["zip 解凍 centos",0,2,0,84.5]
["zip 解凍 linux",0,106,0,80.2]
["zip 解凍 linux コマンド",0,4,0,85.3]
["zip 解凍 コマンド linux",0,2,0,97]
["zip 解答 linux",0,3,0,72.3]
["zip 除外",0,9,0,26.3]
["zip 除外 ディレクトリ",0,2,0,60]
["zip.tmp",0,1,0,8]
["zipコマンド linux",0,4,0,77.5]
["zipコマンド ディレクトリ",0,1,0,94]
["zip解凍 linux",0,1,0,82]
["zlib php install",0,2,0,56]
["ztdummy",0,2,0,47.5]
["zファイル 解凍",0,16,0,58]
["あんつ",0,1,0,6]
["アウトルック vba",0,8,0,47.6]
["アウトルック タイマー",0,2,0,48.5]
["アウトルック フォルダ分け",0,1,0,86]
["アウトルック マクロ",0,20,0,56.5]
["アウトルック メモ",0,1,0,68]
["アウトルック メール 取り消し",0,7,0,89.1]
["アウトルック 投票ボタン",0,1,0,65]
["アウトルック 添付ファイル 保存先",0,1,0,86]
["アウトルック 返信",0,2,0,85]
["アウトルック 送信トレイ",0,2,0,91]
["アウトルック 配布リスト",0,1,0,71]
["アパッチ 再起動",0,2,0,54]
["アンツ",0,86,0,1.8]
["アンツデザイン",0,6,0,12.3]
["アンツ／antz",0,3,0,4.7]
["インスタンス名",0,9,0,90.3]
["エクスポート 電話帳",0,3,0,83.7]
["エクスポートとは 電話帳",0,2,0,92]
["エクセル vba findnext",0,4,0,66.5]
["エクセル vba outlook メール作成",0,5,0,57.8]
["エクセル vba メール",0,6,0,64]
["エクセル vba メール作成",0,9,0,61.3]
["エクセル vba メール送信",0,10,0,82.7]
["エクセル マクロ find",0,2,0,90]
["エクセル マクロ outlook",0,2,0,39.5]
["エクセル マクロ outlook メール作成",0,2,0,20]
["エクセル マクロ set",0,1,0,52]
["エクセル マクロ メール",0,1,0,61]
["エクセル マクロ メール 添付",0,11,0,87.1]
["エクセル マクロ メール作成",0,13,0,77.3]
["エクセル マクロ メール送信",0,10,0,81.2]
["エクセル メール 一斉送信 マクロ",0,1,0,75]
["エクセル メール作成 マクロ",0,2,0,72]
["エクセル メール送信 ボタン",0,11,0,81.7]
["エクセル メール送信 マクロ",0,11,0,71.599999999999994]
["エクセル 投票ボタン",0,1,0,84]
["エクセル 自動メール送信",0,1,0,95]
["エクセルvba メール送信",0,2,0,72.5]
["エクセルvba 予定表取得",0,5,0,41]
["エクセルマクロ メール送信",0,3,0,86.7]
["オフィス ウェブ",0,6,0,6.3]
["オフィス 日本語化",0,2,0,60]
["オフィスウェブ",0,3,0,5.7]
["オープンvpn",0,1,0,83]
["コマンド diff",0,1,0,82]
["コマンド ln",0,10,0,85.3]
["コマンド rm -rf",0,1,0,94]
["コマンド ファイル削除",0,1,0,55]
["コマンド フォルダ 削除",0,2,0,88.5]
["コメントアウト タグ",0,30,0,63.4]
["コメントアウトタグ",0,5,0,57.8]
["コンテキスト形式",0,1,0,21]
["コンマで区切る",0,1,0,97]
["シンボリックリンク ln",0,24,0,66.099999999999994]
["シンボリックリンク オーナー",0,2,0,67.5]
["シンボリックリンク コマンド",0,3,0,82.3]
["シンボリックリンク パーミッション",0,2,0,45]
["タグ コメントアウト",0,2,0,55.5]
["テストケース ツール",0,2,0,97]
["テストケース 管理",0,9,0,74.8]
["テストケース管理",0,15,0,84.5]
["テストケース管理ツール",0,26,0,49.8]
["デザイナー",0,2,0,1]
["デザイン 携帯",0,2,0,5]
["デザイン携帯",0,2,0,5]
["ドリームウェーバ",0,1,0,91]
["ドリームウェーバー",0,1,0,98]
["ドリームウエバー",0,1,0,89]
["バウンス メール",0,5,0,93.8]
["バウンスメール",0,64,0,93.1]
["バグジラ",0,10,0,52]
["バグトラッキングツール",0,2,0,90.5]
["バリアント型",0,1,0,90]
["パイプ 標準出力",0,1,0,88]
["パイプ処理",0,9,0,46.1]
["パッチ コマンド",0,4,0,14]
["パッチを当てる やり方",0,1,0,39]
["パッチコマンド",0,1,0,87]
["パッチファイル 作成",0,1,0,67]
["パッチファイルとは",0,4,0,76.5]
["パッチ処理",0,1,0,88]
["パーソナルフォン",0,1,0,18]
["パーミッション linux",0,1,0,99]
["パーミッションとは linux",0,1,0,96]
["ファイル アップローダー",0,1,0,95]
["ファイル 削除 コマンド",0,1,0,54]
["ファイル 差分 コマンド",0,1,0,88]
["ファイル 移動 vba",0,1,0,96]
["ファイルの削除 コマンド",0,1,0,69]
["ファイルアップローダー",0,4,0,91.8]
["ファイル削除 コマンド windows",0,1,0,99]
["ファイル移動 vba",0,2,0,94.5]
["フォルダ 圧縮 linux",0,1,0,81]
["フォルダ作成 vba",0,3,0,83.3]
["フォルダ削除 vba",0,2,0,66]
["ホストファイル",0,1,0,94]
["マクロ application",0,10,0,71.2]
["マクロ find",0,21,0,89.5]
["マクロ findnext",0,1,0,55]
["マクロ for next",0,3,0,90.3]
["マクロ integer",0,1,0,87]
["マクロ outlook",0,7,0,53]
["マクロ outlook メール作成",0,5,0,28.4]
["マクロ redim",0,2,0,77.5]
["マクロ sendkeys",0,3,0,47.7]
["マクロ set",0,3,0,69.7]
["マクロ variant",0,1,0,58]
["マクロ アウトルック",0,1,0,59]
["マクロ フォルダ作成",0,1,0,94]
["マクロ メール作成",0,6,0,68.2]
["マクロ メール送信",0,10,0,77.8]
["マクロセンド",0,8,0,71.099999999999994]
["メッセージ vba",0,3,0,92]
["メール vba",0,10,0,57.6]
["メール サーバー 構築",0,7,0,79.400000000000006]
["メール タイマー送信 outlook",0,1,0,90]
["メール マクロ",0,2,0,92]
["メール 取り消し outlook",0,1,0,99]
["メール 本文 エクセル 取り込み",0,1,0,68]
["メールサーバー postfix",0,2,0,58]
["メールサーバー 構築",0,156,0,80]
["メールサーバー構築",0,2,0,57]
["メール作成 vba",0,2,0,83]
["メール作成 マクロ",0,4,0,70.3]
["メール送信 vba",0,4,0,86.3]
["メール送信 マクロ",0,3,0,72.7]
["ヤムルファイル",0,1,0,50]
["ラジオボタン 改行",0,1,0,52]
["ループバックマウント",0,1,0,84]
["レポート 余白",0,2,0,90.5]
["ワンショットaf",0,1,0,62]
["健忘録 備忘録",0,1,0,77]
["備忘録 ソフト",0,1,0,94]
["備忘録 テンプレート",0,6,0,71]
["備忘録 メール",0,1,0,45]
["備忘録 使い方",0,3,0,84.3]
["判断樹",0,1,0,65]
["加藤 デザイナー",0,3,0,6.3]
["動的配布リスト",0,1,0,79]
["受信トレイに新着アイテムがあります",0,4,0,43]
["可変変数",0,25,0,55.4]
["可変変数 php",0,10,0,83.7]
["圧縮 linux",0,1,0,92]
["姓名判断 有料",0,5,0,63]
["定数 vba",0,1,0,90]
["広告 外注",0,1,0,100]
["携帯 デザイン",0,1,0,6]
["改行区切り",0,1,0,61]
["数字 コンマ",0,6,0,94]
["文字列 比較 php",0,14,0,85.4]
["文字列比較 php",0,11,0,79.099999999999994]
["新しい outlook",0,1,0,39]
["新しいoutlook",0,2,0,52.5]
["新しいキーリングのパスワード指定",0,2,0,74]
["日本 語 パッチ ダウンロード",0,1,0,80]
["日本語パッチ ダウンロード",0,1,0,58]
["日本語化パッチ ダウンロード",0,1,0,71]
["最短一致",0,1,0,121]
["株式会社サンステップ",0,2,0,57]
["株式会社ペイントハウス",0,1,0,53]
["標準出力 パイプ",0,2,0,65]
["樹門幸宰",0,6,0,48.5]
["正規表現 * +",0,1,0,92]
["正規表現 /u",0,2,0,97.5]
["正規表現 u",0,1,0,86]
["正規表現 から始まらない",0,1,0,20]
["正規表現 で始まらない",0,4,0,67.8]
["正規表現 始まらない",0,16,0,51.8]
["正規表現 最短一致",0,1,0,91]
["正規表現 終わらない",0,18,0,9.1]
["無題の添付ファイル",0,4,0,86.8]
["無題の添付ファイル txt",0,1,0,43]
["空ファイル 作成 コマンド",0,1,0,59]
["空ファイル 削除 コマンド",0,3,0,33.299999999999997]
["窓の杜 winscp",0,12,0,68.400000000000006]
["解凍 gz",0,2,0,70]
["解凍 linux",0,1,0,92]
["解凍 tar.gz",0,1,0,71]
["解凍 tgz",0,14,0,69.400000000000006]
["送信トレイ 送信済み",0,1,0,98]
["送信済みアイテム",0,15,0,80]
["配布リスト outlook",0,1,0,60]
["電話帳 インポート",0,4,0,87.3]
["電話帳 エクスポート",0,2,0,83]
["電話帳エクスポートとは",0,1,0,97]

{"sheet":"_集キーワード","index":12,"n_rows":50,"n_cols":3,"rows_kept":50,"cut":false,"hidden":true,"merged":[[0,0,0,25],[9,0,9,25],[13,0,13,25]]}
["_集キーワード"]
["Last Run On","2019-07-22T11:24:59"]
["View Name","すべてのウェブサイトのデータ"]
["Total Results Found",42]
["Total Results Returned",42]
["Contains Sampled Data","No"]
[]
[]
[]
["Totals For All Results"]
[null,null,"Organic Searches"]
[null,null,167]
[]
["Results Breakdown"]
["Keyword","Source","Organic Searches"]
["(not provided)","google",137]
["(not provided)","yahoo",27]
["ホームページ制作","yahoo",2]
["(not set)","google",1]
["(not set)","(direct)",0]
["(not set)","222.16.100.102",0]
["(not set)","102.32.0.142:10080",0]
["(not set)","adwords.corp.google.com",0]
["(not set)","asahi.com",0]
["(not set)","blog.livedoor.jp",0]
["(not set)","cse.google.com",0]
["(not set)","cse.google.com.ph",0]
["(not set)","digital.asahi.com",0]
["(not set)","download.co.jp",0]
["(not set)","eto.lightning.force.com",0]
["(not set)","facebook.com",0]
["(not set)","hayabusa3.2ch.sc",0]
["(not set)","infith.com",0]
["(not set)","itest.5ch.net",0]
["(not set)","jp.mg5.mail.yahoo.co.jp",0]
["(not set)","kyodemo.net",0]
["(not set)","l.facebook.com",0]
["(not set)","l.moapi.net",0]
["(not set)","lancers.jp",0]
["(not set)","m.facebook.com",0]
["(not set)","m.youtube.com",0]
["(not set)","mixi.jp",0]
["(not set)","n2ch.net",0]
["(not set)","nozomi.2ch.sc",0]
["(not set)","safetyaction.tokyo",0]
["(not set)","t.co",0]
["(not set)","t.umblr.com",0]
["(not set)","twitter.com",0]
["(not set)","www-asahi-com.cdn.ampproject.org",0]
["(not set)","youtube.com",0]

{"sheet":"_行ページ","index":13,"n_rows":60,"n_cols":7,"rows_kept":60,"cut":false,"hidden":true,"merged":[[0,0,0,25],[9,0,9,25],[13,0,13,25]]}
["_行ページ"]
["Last Run On","2019-07-22T11:25:03"]
["View Name","すべてのウェブサイトのデータ"]
["Total Results Found",62]
["Total Results Returned",62]
["Contains Sampled Data","No"]
[]
[]
[]
["Totals For All Results"]
[null,"Pageviews","Sessions","Avg. Time on Page","Entrances","Bounce Rate","% Exit"]
[null,37404,15045,55.325327608569197,15045,0.66161515453639086,0.40222970805261471]
[]
["Results Breakdown"]
["Page","Pageviews","Sessions","Avg. Time on Page","Entrances","Bounce Rate","% Exit"]
["https://www.officeants.com/",18088,11695,60.476828256489199,11695,0.69063702436938867,0.53355816010614776]
["https://www.officeants.com/try/",5867,188,20.076357697019098,188,0.61702127659574468,0.16516107039372763]
["https://www.officeants.com/event/",2537,731,115.338473400154,731,0.68946648426812585,0.48876625936145052]
["https://www.officeants.com/try/5.php",1094,20,45.619419642857103,20,0.55000000000000004,0.18098720292504569]
["https://www.officeants.com/try/3.php",874,13,38.187002652519801,13,0.69230769230769229,0.13729977116704806]
["https://www.officeants.com/try/4.php",695,10,34.882258064516101,10,1,0.10791366906474821]
["https://www.officeants.com/try/2.php",664,12,45.981878088962098,12,0.58333333333333337,8.5843373493975902E-2]
["https://www.officeants.com/try/1.php",610,17,41.695121951219498,17,0.82352941176470584,0.19344262295081968]
["https://www.officeants.com/pipo/3.php",450,191,44.034482758620598,191,0.53403141361256545,0.35555555555555557]
["https://www.officeants.com/game/",340,26,163.96585365853599,26,0.73076923076923062,0.39705882352941174]
["https://www.officeants.com/pipo/2.php",280,7,12.3524590163934,7,0.8571428571428571,0.12857142857142856]
["https://www.officeants.com/pipo/",262,3,15.1737288135593,3,0.33333333333333326,9.9236641221374045E-2]
["https://www.officeants.com/queenstars/",221,7,98.946107784431106,7,0.42857142857142855,0.24434389140271492]
["https://www.officeants.com/cm/",197,6,105.615384615384,6,0.83333333333333348,0.27411167512690354]
["https://www.officeants.com/pipo/1.php",188,1,47.1666666666666,1,0,0.20212765957446804]
["https://infith.com/formtest/research/index.php",8,1,89.75,1,0,0]
["https://www.officeants.com/?fbclid=IwAR1T-5hYKmn7pX7e4LUL7HO4pu2YxMxHKmsPKrszrtWZJQD1y17gKm2qPHk",7,6,48,6,0.66666666666666652,0.7142857142857143]
["https://www.officeants.com.googleweblight.com/",5,2,6.3333333333333304,2,0,0.4]
["https://www.officeants.com.googleweblight.com/event/",2,0,10.5,0,0,0]
["https://www.officeants.com/try/1.php?fbclid=IwAR05ndgxdTRPR1WbsPXwcKSFy2BBFAmQRLi1RQ1g7aBLAwD_UAxpHfrJW0g",2,1,115.5,1,0,0]
["https://www.officeants.com/try/1.php?fbclid=IwAR3k7uYDVVR2GT1JI8zmmre3uBgjhhfwD9kAuDd39sA-0BkZeT3D3QZDM4Y",2,1,17,1,0,0]
["https://www.officeants.com.googleweblight.com/pipo/",1,0,6,0,0,0]
["https://www.officeants.com/?fbclid=IwAR0r-GqwQDNfYutbpkDBfzxBrVA0oaRwigHZF7BzIaPtathRx0rSHmF1Am0",1,1,0,1,1,1]
["https://www.officeants.com/?fbclid=IwAR2oNuzHtekWkscFE_pqcFYLq6msY4j6ypgepYqBTLrmO2UK-h087f3Gl_4",1,1,26,1,0,0]
["https://www.officeants.com/?nx=146&ny=25&clkt=18&bg=!pKelp79EfItg73rA6mECAAAAklIAAAAwmQGMOSOI79eMVpEuw4EaDMDMXwJZavP0CusogkWKJ1RcBaQU3i-YrsG0OM5--6cg1uBytDxFCEnpElQI6GA_PsTqsxLHQtExwXj3diozTv-b8cShMWTR1r_ZWB7zp9T7ytETfNJyUMgDzH4qENNFSV_nNjgZOYyGr18J2z-Sx-iJUq-3J0dWjxIX9_b8Ki5WMnCpMyxy8fJpMJ0plOYFpst4vnT1ybEXCKIr1UfoQ58dT6426AhW2CY0AtZug406E-OiExlA_nNySBLamaOw8I_fgW0vBHI_PTeTmgoItijbxY4k9Em9cU6qjMZVaHVVYUc57f_SoJtfLjDPdFg_prC7SWlhYprHk0NhamX_NVwOq9CaSHxRB6clLn09gX3eGbcK5Vf4gFa28exmJWSPApI3n4KnJBE93t-7cFgxFjI6FYjDNpCWIV6L5ADXsSX6ceKcgqeLph-p-L_SQ-ZMzPuan2gbU2PlSDvKN60TOarp5ZtN_uyvSOoPok_SjnW4dqmhljWr2C2iChiYtKE-",1,1,0,1,1,1]
["https://www.officeants.com/?nx=155&ny=20&clkt=6&bg=!enmleWFEgC7U8g7uBn4CAAAAV1IAAAAbmQF87QywD_lHSJEtYqcWFWz6VGKhJyVeTD6okldjxzBVvS2P1Z9F-KYlIlTpaD3GQNIvTG5Atuh8smWWR3W429MSlv57Xn4PXbeqVHt_BhQqQXoUAb-qDaXjrc_qh5dKam80fC772xGfwMOkZeewZNfDwOkqF4_vqqF_nHs0ZVHoFmbrHDVRf5MHfQi7LndR5pIffSJQO_-qFcRU5QD4EF3l3u59vYOCtkOb6iYzxoaOsy4XsFbxf-ue1LurY1W9K2VOHUETlQIOZCUKWloIVB-D9FTzUpyKUtzXKWHMAYACCXmQyL3R9uBJ11LkQEC9DOlQULexawZpaxEl85k359qUJFedTwK93MUdtcIlB_PR_CIfgfZ_3_bkpxVxSYRVcqKNFcAtdZF8QsUK3kEZSpMZLQfRPP88dh0HAbLaYi0fkV-NCf83gATboh6__Szq8oXwrM4nXOsPwPJPSG205zJXhQkcg5DRM1VilBC9mGL-Kmjj2g6rh-Cri7JDX5c",1,1,0,1,1,1]
["https://www.officeants.com/?nx=166&ny=37&clkt=17&bg=!5uWl5f1EjTyNzw1RBssCAAAAolIAAAA1mQF8Jxfq9R_q4CqcwIaL3HK1FuCNLM5hwHXZNLd5haJPjtBxyJniufyi1YpvUaVRtw2T-gRaNw60Rm_IpKU17du_1bWbhN91CCutGjSfd8z3cSzEunIJUimXs1FyzqfjHUWqoNZcOrganhE63PtsYFtZnzcn8HMlqWbXWJCw8yHBpgpf8uX2BNP3UuVOMTpw7cKhm7wJxJOr_pyeEdbhN4LB3kClrmVjQZ1q3giEcGeGaAUmi8C0Z_1DYdgGPPdrpmS1xkVOuxBv64VvMQs4bYlUu6uS_T9V80Cwt2DZsZgsQhmlI_Wwl24xclanHdrDxtxriDMb4O9dOyltFyYRQ4QdIqDhT7T-3ABqVYQZcTY_wxK_Li8SwBiBQuGlWOUg-EpgsyxIPCM4V-GLBAVaB-pBa16U1d5F53rrWC0yVwpK4WRoZ0foz1qbnNRGmiNgzDvG7tnYNO2bxWYQ3_V_1IWaBqTmOjKXLGMRV174Qn1NexIKwy6qsIhRcWHZe00",1,1,0,1,1,1]
["https://www.officeants.com/?nx=218&ny=34&clkt=5&bg=!3t2l3cVEesG_1F6p1aQCAAAAU1IAAAAVmQGMA2hsPvtTmCyxDybBZEhaZ9h4yL8FSWBYCxtmN4Ffw5M61oD-sX__6xmoFMuZLXy94p5333y0uxK0PTZlDy6y9UC-YguB6-5JqZ9-VqB0CEyHFz2ysnzgJGMElDHooWdgTJZsIarq0IEGqQW-q-IuxZJAhenwFja-vojJpBegHekNQKAf72f5knNGuNnkSkWPZ5KfKe2_BZO2H97uyWQZ1-CIeQK-QI9KrF1YxxtZlv7r_t4YVfo1BbejIr8Z3Xfil3LIwUi0zU-kilnhhj9-fTedDctPamsemgd-JSOznOg5v62HmJClBdaWxcqaAUpdFtRLbzrVDAS1nAC8uqol5wuF-oUgyTLTgozGCJ3pM4x7bZfaaNq7qGpI4No8RrsZLnLkRlGtll0OStnGHc0fIDK4GGQceUCq3-ohsiuEGlPAflYxtNJ5wHV6kvYjuJU7mqhfYeTOVmD2voYfaR6CDD1YsZjey4mYZAQYBEhATycI9DdFAE6v-VyDCv2f7NMIl_ZD34zLTZOmL2e-",1,1,0,1,1,1]
["https://www.officeants.com/?nx=249&ny=33&clkt=12&bg=!lpWllY1Em456ZSqln4wCAAAAnFIAAAA0mQF81b7xadixYoI4ajJuD5fqUkXyTN2XW3LxyZKWyN8oG4Fy0QrbF7fp-hC0yG8c5DZRL40ZgfzD8_hytjhODqOin9aYMsUFbeJI7scGGhHkvtSVuOloYLg-eAWyw4A6-C5YPgJJQ1jVTKapCynEzbs7k-FdCr3bskut-LCx5MyexLxdtavFvcCBjWvlUJWxGERRoTRDv7Uhnhg2qYk7MGE9ST91CJcz3bBGhv-BtT3BfKy283zZqnqk9olFUtxr80RHqGIiI7Nq8eroWqi_e4SDN44eIV_j6iyNRuc3So2VfVfACOQ3FuHPf_C20_CHvEt89xgoo3h5cpMEksGcWPiIOBGPEN3Z7oKv0wdiu_Touw8auVGQYI6dEuAKfh1bTXv0oC1Sonu-IKVnlDwWLaToBANWjMF7VZwNDh6dX4y77bqiwmU59YAky3Ikl6N2DUTXGAz5r8Bf5I5-pEKVIE1Va8Uy1A8pMNEp84EhG9tyAJRANhYX6Ki8fIL5sTs",1,1,0,1,1,1]
["https://www.officeants.com/?nx=265&ny=37&clkt=14&bg=!KSqlKjJEwsGQAMjZxqICAAAAk1IAAAA4mQF8sahCTSfQVGLr_mxG-G3RF-CWn1C2CPUmnbYF1YtmrWdeE_PZoLDhpjNHBJbNSIkQ2HflDKazpqQefHgujSIB_nXn1ecmUM_t9lySKMCy3-fw5P2mYRV1y_Npp5DW2l5I3T6r_yms3w2kKNwjJr-VG4WGgoAfILMerdos4sLw8KPyz8dr0NBIE9Frn4hK_QHMqXBP5FiCGfZ4vp7ULovlkiGQBxJSWjShEdtwiMmNGsiDdYvdyPZ_SeBgYYI3WaVot0a11SxX2nKSoXEZoAfcVv-0G6EfiCJhjqEGJ5nofbOvLjcsQQRFjrpR7Q8FEWuTnRnGF9gFGn3klVi8R2qWraxBQ_qb-3JpD2JURdMh2m0cRqNgXe4zCjJMgDV9IgeZ7hJX4ym57O8revDwr2D0fQZO9yDF19sBQv9bsGGFmBVh6t63nFg3NPFAKcPxOWPmFmF1X26mEcwkiVaExE6uxGW3YQknW0056LsnJFzJHtRArSmzrcx21L-4DCo",1,1,0,1,1,1]
["https://www.officeants.com/?nx=272&ny=3&clkt=18&bg=!wcKlwtpEP2r2bV4Ze1ICAAAAilIAAABKmQGMd74eW2LcAvTUgw_OwOy-ZyVw__t5_hYCgazEiADrlw2w2nPlmb4VYKRaR4jdT9NpQGzU0OpvtzivJCPb8Ml4mt2zSHrMRYL7JXse2j5W0yWYrf6KTPgpAdsgrfMhCCe6UT8B1MSAXnEH4eAjAQrPOOaRd3Xhb2KEcU-fnNkR0P9bU9gxEsrNDJLTHpG42YZXj3wpTRPlygAzcsN4UKsgnNzLLPl1REfISG2c6lvyWR_e5GbZCCerAsoClSKQX3qh7XvX08d5h5JuWiIJ7o8lKNQcIBEF2LcObctrgTNOVPvtrqPpI-m9tbcjNY4q-lN5f3-d6b9MBkvyXvasPNX8O8Ut3Lc4RRvblhhiMn78llxLENq6SpOOtCu0cUuisASoS397pSxpBZ5ZqebK-h-1UHfhn8xxRnut4D6-CUt-HPyduoauqWb-Hp9zbRV3KXXxW09CSMxH1O0nLjz0WUgXHANa8TrOi2dcmLmCAmu3l2yVnsCFr9W9oL75dFHYDE4YuGydULM6a6tqPrzf",1,1,0,1,1,1]
["https://www.officeants.com/?nx=305&ny=75&clkt=43&bg=!AwClABhEj9C-Bhh9vXMCAAAA-lIAAACFmQGMOsVrE9vpZ_5Wc-uxmitQiDI2BFKhx47KGnNizrjc4KiSk204TOOrsimde3D-HC2ukoLDZjbxzxwNQ_e8nJ4eXPVBkVs7swQPenrYCjZuRPqQKj4cz-5lCKbuomEVocpE-63rMunpKZuJi_Jn8ab8oSigdfSs1E-AIRwcFjVJev-s2X5BJdDCq9d_GL1mdYpAXkPCNrFDwzmTUCwyZgU4VlB8TqLkTGXYrf4P5n67dxTFJTdpnBPPux8kc5SgWZJAxVAI-9RoG5nWw2cs-KkVQpw0FpZj-S8rfQEGMvymEgYgFMPirTtfCIZZkFcoDd9ofD23MuurpvE75fQPORQPu8g39xDnn5ffqGHwVM8_bikaiGmQ4R_X1kF3uRZ6DQ2NXqfKvApxh_SIRAPjRzP5njMl-QNhDTocikbBKO_q5ofeMp9A4Q0fGsj-OJfK3W7qTjoItGdfhHmlG2pw7-MWDSAbQNYx--_1XJ0RAVrheMWevE1X_rXsSD-Yxj1fpm3Os_wa4gC00h3gOHp2",1,0,0,0,0,1]
["https://www.officeants.com/?nx=85&ny=56&clkt=24&bg=!XF-lX0dELfdqRevgaAsCAAABWVIAAAB5mQF8582xAg4zjUy3I7FztU_JWoHAlyAY8UUYjXp--Eh1OcelTJSKqDdqFwwUlhLA6Y9iaKHOdkE9dyXr7QLHo0tZ-dVf1H474Guk-zQaomZM90ErEoIEYYx4ORmUAEp6-KCLqIaVTkxrCW5xDypsive5oiFMOOMzxDPHHfJTFaRSAJICVo4Y0HebbZjSJ-frKHxnGPzuoBo3j_j3UZ6EHg3UibDdBXuhnKnyXhGSpRB0eXo1aAHTr60TTjgxX4rJnFht4-0-4f3lVAcpskywIwC1yaN7hjeRfgeXpe-MwxBjHMFjj_v37JQKMCvw1D6y8DQAZG66kXLpWv--0apNgHevqleLZYCf568QCb2_jFnKqGuE5B7J_pbCEr7iQhkhoc2c8gV5nUL1SVn0u3fXsNk45lVVgjLCv_2Is2-LSkvOH1wBU8-K51EHpbIlX9_KWxJNUGuRA6VBkg1r0QSTxyBwKFJzoRUp_fbUV54LR_MGF4QjfsJqj80vw9JKbxg",1,1,0,1,1,1]
["https://www.officeants.com/?nx=9&ny=18&clkt=8&bg=!8fKl8upEmcO6nyR9rVsCAAAAUlIAAAAemQF8vtJ0HfgSsNY93kxb_yn5a3EfwassqcaKuWAaVMrBW5ZUgInhFzvPb78CrV40ir28S0yFvj1FlF3IlVHAbsV_kMkHyDLvwJuqaNaAcr8pjStza4LgTwlDmfRPzw7u9LvR1j3gAa2wrRMKWKSCdeEXcaHOaKgqEw4sYB7pAX0ghXZntZToOHR7CRs-pW5DflIyCXfPZtNjmNnHgncTE82NW8FrfHogW8CkoaUJTPZe-X3xhrzde18fhpispZ9796vmOchM33kKphaedriJS2ghotj_T1RRLJwIG2qb67KxkkRk5rqBwu4-jgiUmiW9dyUcqrZsGi28AyDnrXlEoo8S7axr5cGjuhtQ5QTqjGCksudDUrLwxCUZdHhm1bFGQou5EGoypkJRgUIsI5VgirS3A4bT8NrupbVpVDCpjFL8BFWaW9reN5KWCLi_TNDw34BbsUa3EvoPAtYOkaRYodkizad2BRJy03P3A6Nzmj55RUai8odRsDOFQouIeDs",1,1,0,1,1,1]
["https://www.officeants.com/index.php",1,0,0,0,0,1]
["https://www.officeants.com/try/?fbclid=IwAR0S_2NQl8MHFjX9HwkVcCgGiWYNQMmusB7sHJd0bBjALUVn54s29joTzpc",1,1,144,1,0,0]
["https://www.officeants.com/try/?fbclid=IwAR0YjpCiBPlLf8oQq0icOIvVoXS3h4V8VWoHUGVpZNESm_0HKaiHsPquXok",1,0,14,0,0,0]
["https://www.officeants.com/try/?fbclid=IwAR1TlXOpNhFY1a6dzu2PcImGh6Lvx8Q0RI1X_Iyi3AxrSa_DGHhytLKZEwc",1,0,1212,0,0,0]
["https://www.officeants.com/try/?fbclid=IwAR2-unkUWejBVtNT95A-8D4N2AnpDTujjyJ9dtkA5gvfKeBa5O4VhPp8oqY",1,1,9,1,0,0]
["https://www.officeants.com/try/?fbclid=IwAR2J3Nyblx5HiqRwRFD7sxs6u9ACfK_shcAVIdi1EcPC6D-t3E1CVcBkZh4",1,0,16,0,0,0]
["https://www.officeants.com/try/?fbclid=IwAR3I0WvtcB11Xd7hSKuqtq4tQXp14tPEgW-UzIsDFL8OorzeKi8pti21YsE",1,1,41,1,0,0]
["https://www.officeants.com/try/1.php?fbclid=IwAR0DOzMg-3zH-tv5f9A0acQwVApP8R3Aig8RsN-zRcssfAT3G8DxV9BJ9qo",1,1,0,1,1,1]
["https://www.officeants.com/try/1.php?fbclid=IwAR0pR5FsskCFjRRFyuMECy_zh9pgQMdrrxmJSJkZTRLQnQq7Pn7LzyptwlI",1,1,0,1,1,1]
["https://www.officeants.com/try/1.php?fbclid=IwAR1Huq0H3UsCUZFPhxX9rk91dc7rKsJLtaEEGlh3nSLoEa_81Y2RXZYOJGc",1,0,0,0,0,1]
["https://www.officeants.com/try/1.php?fbclid=IwAR3vlvP-Kqa4twFyj3NuAeo_y6oOE3xcnn8qB_WfoO8jR2-llGeX42ijNXU",1,1,0,1,1,1]

{"sheet":"_ユ","index":14,"n_rows":16,"n_cols":9,"rows_kept":16,"cut":false,"hidden":true,"merged":[[0,0,0,25],[9,0,9,25],[13,0,13,25]]}
["_ユ"]
["Last Run On","2019-07-22T11:25:01"]
["View Name","すべてのウェブサイトのデータ"]
["Total Results Found",1]
["Total Results Returned",1]
["Contains Sampled Data","No"]
[]
[]
[]
["Totals For All Results"]
["Users","Sessions","Pageviews","Bounce Rate","Avg. Session Duration","Number of Sessions per User","Pages / Session","ga:goal1Completions","ga:goal2Completions"]
[12247,15045,37404,0.66161515453639086,82.221535393818499,1.2284641136604799,2.48614157527417,0,0]
[]
["Results Breakdown"]
["Users","Sessions","Pageviews","Bounce Rate","Avg. Session Duration","Number of Sessions per User","Pages / Session","ga:goal1Completions","ga:goal2Completions"]
[12247,15045,37404,0.66161515453639086,82.221535393818499,1.2284641136604799,2.48614157527417,0,0]

{"sheet":"_ユ推移","index":15,"n_rows":46,"n_cols":4,"rows_kept":46,"cut":false,"hidden":true,"merged":[[0,0,0,25],[9,0,9,25],[13,0,13,25]]}
["_ユ推移"]
["Last Run On","2019-07-22T11:25:01"]
["View Name","すべてのウェブサイトのデータ"]
["Total Results Found",5]
["Total Results Returned",5]
["Contains Sampled Data","No"]
[]
[]
[]
["Totals For All Results"]
[null,"Users","Sessions","Pageviews"]
[null,12979,15045,37404]
[]
["Results Breakdown"]
["Date","Users","Sessions","Pageviews"]
["2019-07-01",5160,6417,20179]
["2019-07-02",4856,6468,21179]
["2019-07-03",4552,6519,22179]
["2019-07-04",4248,6570,23179]
["2019-07-05",3944,6621,24179]
["2019-07-06",3640,6672,25179]
["2019-07-07",3336,6723,26179]
["2019-07-08",3032,6774,27179]
["2019-07-09",2728,6825,28179]
["2019-07-10",2424,6876,29179]
["2019-07-11",2120,6927,30179]
["2019-07-12",1816,6978,31179]
["2019-07-13",1512,7029,32179]
["2019-07-14",1208,7080,33179]
["2019-07-15",904,7131,34179]
["2019-07-16",600,7182,35179]
["2019-07-17",3336,7233,36179]
["2019-07-18",3032,7284,22179]
["2019-07-19",2728,7335,22179]
["2019-07-20",2424,7386,22179]
["2019-07-21",2120,3321,23179]
["2019-07-22",1816,3321,24179]
["2019-07-23",1512,3321,25179]
["2019-07-24",3336,3321,26179]
["2019-07-25",3032,3321,27179]
["2019-07-26",2728,3321,28179]
["2019-07-27",2424,3321,29179]
["2019-07-28",2120,3321,30179]
["2019-07-29",1816,3321,31179]
["2019-07-30",1512,3321,32179]
["2019-07-31",1208,3321,33179]

{"sheet":"_ユデバイス","index":16,"n_rows":18,"n_cols":2,"rows_kept":18,"cut":false,"hidden":true,"merged":[[0,0,0,25],[9,0,9,25],[13,0,13,25]]}
["_ユデバイス"]
["Last Run On","2019-07-22T11:25:02"]
["View Name","すべてのウェブサイトのデータ"]
["Total Results Found",3]
["Total Results Returned",3]
["Contains Sampled Data","No"]
[]
[]
[]
["Totals For All Results"]
[null,"Users"]
[null,12263]
[]
["Results Breakdown"]
["Device Category","Users"]
["mobile",9491]
["desktop",2280]
["tablet",492]

{"sheet":"_ユ国","index":17,"n_rows":154,"n_cols":2,"rows_kept":154,"cut":false,"hidden":true,"merged":[[0,0,0,25],[9,0,9,25],[13,0,13,25]]}
["_ユ国"]
["Last Run On","2019-07-22T11:25:01"]
["View Name","すべてのウェブサイトのデータ"]
["Total Results Found",139]
["Total Results Returned",139]
["Contains Sampled Data","No"]
[]
[]
[]
["Totals For All Results"]
[null,"Users"]
[null,12253]
[]
["Results Breakdown"]
["Country","Users"]
["Japan",8719]
["India",499]
["Taiwan",246]
["South Korea",201]
["Indonesia",193]
["Thailand",175]
["Philippines",173]
["Hong Kong",168]
["Malaysia",152]
["Vietnam",146]
["United States",102]
["Singapore",100]
["Turkey",67]
["Pakistan",60]
["Brazil",57]
["Mexico",54]
["United Kingdom",50]
["Cambodia",44]
["Italy",39]
["Sri Lanka",37]
["Myanmar (Burma)",36]
["Germany",34]
["France",31]
["Saudi Arabia",31]
["Poland",30]
["Argentina",29]
["Romania",27]
["Mongolia",26]
["Iran",24]
["South Africa",23]
["Bangladesh",22]
["Egypt",21]
["Nepal",21]
["Nigeria",20]
["Spain",20]
["Canada",19]
["Russia",19]
["Hungary",18]
["Morocco",18]
["United Arab Emirates",18]
["China",17]
["Netherlands",17]
["Australia",16]
["Georgia",16]
["Israel",15]
["(not set)",14]
["Colombia",14]
["Algeria",13]
["Bulgaria",12]
["Macao",12]
["Ghana",11]
["Greece",11]
["Iraq",11]
["Ukraine",10]
["Austria",9]
["Chile",9]
["Peru",9]
["Croatia",8]
["Czechia",8]
["Laos",8]
["Latvia",8]
["Belgium",7]
["Kenya",7]
["Portugal",7]
["Slovakia",7]
["Switzerland",7]
["Bosnia & Herzegovina",6]
["Denmark",6]
["Kuwait",6]
["North Macedonia",6]
["Serbia",6]
["Sweden",6]
["Tunisia",6]
["Venezuela",6]
["Brunei",5]
["Lithuania",5]
["Luxembourg",5]
["Mauritius",5]
["Oman",5]
["Tanzania",5]
["Albania",4]
["Armenia",4]
["Azerbaijan",4]
["Bolivia",4]
["Cameroon",4]
["Ecuador",4]
["Estonia",4]
["Finland",4]
["Guam",4]
["Norway",4]
["Paraguay",4]
["Qatar",4]
["Bahrain",3]
["Congo - Kinshasa",3]
["Uganda",3]
["Afghanistan",2]
["Angola",2]
["Botswana",2]
["Congo - Brazzaville",2]
["Costa Rica",2]
["Dominican Republic",2]
["Haiti",2]
["Ireland",2]
["Jordan",2]
["Kazakhstan",2]
["Maldives",2]
["Malta",2]
["Moldova",2]
["New Caledonia",2]
["New Zealand",2]
["Puerto Rico",2]
["Senegal",2]
["Slovenia",2]
["Somalia",2]
["Uzbekistan",2]
["Yemen",2]
["Zambia",2]
["Burkina Faso",1]
["Cayman Islands",1]
["Côte d’Ivoire",1]
["Cyprus",1]
["El Salvador",1]
["French Polynesia",1]
["Gabon",1]
["Greenland",1]
["Guatemala",1]
["Iceland",1]
["Jamaica",1]
["Kyrgyzstan",1]
["Malawi",1]
["Mali",1]
["Mayotte",1]
["Monaco",1]
["Namibia",1]
["Réunion",1]
["Rwanda",1]
["St. Kitts & Nevis",1]
["Turkmenistan",1]
["Uruguay",1]

{"sheet":"_ユ市区","index":18,"n_rows":442,"n_cols":2,"rows_kept":442,"cut":false,"hidden":true,"merged":[[0,0,0,25],[9,0,9,25],[13,0,13,25]]}
["_ユ市区"]
["Last Run On","2019-07-22T11:25:01"]
["View Name","すべてのウェブサイトのデータ"]
["Total Results Found",427]
["Total Results Returned",427]
["Contains Sampled Data","No"]
[]
[]
[]
["Totals For All Results"]
[null,"Users"]
[null,9271]
[]
["Results Breakdown"]
["City","Users"]
["Shinjuku City",1187]
["Yokohama",995]
["Chiyoda City",889]
["Osaka",814]
["Minato City",754]
["Nagoya",371]
["Saitama",207]
["Shibuya City",178]
["Setagaya City",169]
["Sapporo",134]
["Fukuoka",110]
["Kawasaki",104]
["Ota City",75]
["Chiba",74]
["Itabashi City",68]
["Koto City",64]
["Kyoto",57]
["Utsunomiya",56]
["Sagamihara",55]
["Chuo City",52]
["Nerima City",52]
["Hamamatsu",51]
["(not set)",50]
["Adachi City",47]
["Shinagawa City",47]
["Shizuoka",47]
["Kawaguchi",44]
["Suginami City",42]
["Funabashi",41]
["Edogawa City",39]
["Sendai",39]
["Hachioji",37]
["Tokorozawa",37]
["Niigata",36]
["Kita City",34]
["Ichikawa",33]
["Kashiwa",33]
["Kobe",33]
["Fuchu",31]
["Sumida City",31]
["Machida",30]
["Taito City",30]
["Tsukuba",30]
["Toshima City",28]
["Katsushika City",27]
["Koshigaya",27]
["Okayama",27]
["Bunkyo City",26]
["Kawagoe",25]
["Nishitokyo",25]
["Takasaki",24]
["Hiroshima",23]
["Kitakyushu",23]
["Toyama",23]
["Mito",21]
["Nagano",21]
["Urayasu",21]
["Matsudo",20]
["Maebashi",19]
["Nakano City",19]
["Yokosuka",19]
["Fujisawa",18]
["Kofu",18]
["Chofu",17]
["Kanazawa",17]
["Morioka",17]
["Chigasaki",15]
["Ichihara",15]
["Mitaka",15]
["Noda",15]
["Asaka",14]
["Ichinomiya",14]
["Tachikawa",14]
["Tama",14]
["Hadano",13]
["Kodaira",13]
["Koga",13]
["Meguro City",13]
["Ageo",12]
["Kochi",12]
["Matsuyama",12]
["Nagasaki",12]
["Oita",12]
["Sakai",12]
["Yamato",12]
["Fuji",11]
["Hakodate",11]
["Kumamoto",11]
["Narita",11]
["Okazaki",11]
["Ota",11]
["Takamatsu",11]
["Tokushima",11]
["Tsuchiura",11]
["Yokkaichi",11]
["Arakawa City",10]
["Higashimurayama",10]
["Hiratsuka",10]
["Hitachi",10]
["Iruma",10]
["Kumagaya",10]
["Nagareyama",10]
["Odawara",10]
["Ome",10]
["Otsu",10]
["Sakura",10]
["Toyohashi",10]
["Amagasaki",9]
["Fukui",9]
["Kurume",9]
["Niiza",9]
["Nishinomiya",9]
["Numazu",9]
["Suzuka",9]
["Toyota",9]
["Yamagata",9]
["Akishima",8]
["Aomori",8]
["Ashikaga",8]
["Himeji",8]
["Hirakata",8]
["Kagoshima",8]
["Kasukabe",8]
["Koganei",8]
["Kuki",8]
["Kunitachi",8]
["Matsumoto",8]
["Misato",8]
["Naha",8]
["Soka",8]
["Takaoka",8]
["Takarazuka",8]
["Wakayama",8]
["Yaizu",8]
["Atsugi",7]
["Ebina",7]
["Fujimi",7]
["Fukushima",7]
["Gifu",7]
["Higashikurume",7]
["Kamisu",7]
["Kurashiki",7]
["Tochigi",7]
["Yachiyo",7]
["Yotsukaido",7]
["Chikusei",6]
["Gyoda",6]
["Iwaki",6]
["Kamakura",6]
["Miyazaki",6]
["Nara",6]
["Sano",6]
["Shiraoka",6]
["Suita",6]
["Toyokawa",6]
["Toyonaka",6]
["Toyooka",6]
["Yamaguchi",6]
["Yuki",6]
["Akita",5]
["Asahikawa",5]
["Bando",5]
["Hamura",5]
["Hidaka",5]
["Higashiyamato",5]
["Isehara",5]
["Kakogawa",5]
["Kazo",5]
["Kitamoto",5]
["Kiyose",5]
["Konosu",5]
["Koriyama",5]
["Matsue",5]
["Nagahama",5]
["Nagaoka",5]
["Namerikawa",5]
["Ryugasaki",5]
["Saga",5]
["Shiojiri",5]
["Tsukubamirai",5]
["Warabi",5]
["Yonago",5]
["Abiko",4]
["Anjo",4]
["Hanamaki",4]
["Hanno",4]
["Hino",4]
["Hitachiota",4]
["Ichinoseki",4]
["Inzai",4]
["Isesaki",4]
["Izumo",4]
["Joso",4]
["Kimitsu",4]
["Kirishima",4]
["Kisarazu",4]
["Kokubunji",4]
["Minoo",4]
["Mishima",4]
["Moroyama",4]
["Musashimurayama",4]
["Otsuki",4]
["Saku",4]
["Samukawa",4]
["Shimada",4]
["Tajimi",4]
["Takatsuki",4]
["Tokai",4]
["Tomisato",4]
["Ube",4]
["Yamanashi",4]
["Zama",4]
["Chichibu",3]
["Chiryu",3]
["Echizen",3]
["Fujimino",3]
["Fujioka",3]
["Fukuroi",3]
["Hachinohe",3]
["Hitachinaka",3]
["Isahaya",3]
["Ise",3]
["Kakegawa",3]
["Kashihara",3]
["Kasugai",3]
["Kiryu",3]
["Kishiwada",3]
["Komatsu",3]
["Kushiro",3]
["Matsusaka",3]
["Mobara",3]
["Moka",3]
["Moriya",3]
["Musashino",3]
["Narashino",3]
["Nasushiobara",3]
["Nikko",3]
["Ogaki",3]
["Sakado",3]
["Sarufutsu",3]
["Sayama",3]
["Shimonoseki",3]
["Susono",3]
["Tagawa",3]
["Toda",3]
["Toride",3]
["Uji",3]
["Yao",3]
["Aisai",2]
["Annaka",2]
["Bungoono",2]
["Chikuma",2]
["Fujieda",2]
["Fujikawaguchiko",2]
["Fukuyama",2]
["Fussa",2]
["Gotemba",2]
["Handa",2]
["Hanyu",2]
["Hashimoto",2]
["Higashiosaka",2]
["Hita",2]
["Ibaraki",2]
["Iga",2]
["Ikoma",2]
["Inagi",2]
["Inashiki",2]
["Inuyama",2]
["Ishioka",2]
["Iwakuni",2]
["Izumisano",2]
["Joetsu",2]
["Kai",2]
["Kamagaya",2]
["Kami",2]
["Kanuma",2]
["Karatsu",2]
["Kasaoka",2]
["Komae",2]
["Kusatsu",2]
["Kuwana",2]
["Masuda",2]
["Mimasaka",2]
["Minamisoma",2]
["Miyashiro",2]
["Miyoshi",2]
["Murakami",2]
["Obihiro",2]
["Oizumi",2]
["Okaya",2]
["Okegawa",2]
["Omihachiman",2]
["Omuta",2]
["Otawara",2]
["Oyama",2]
["Saijo",2]
["Seika",2]
["Shibukawa",2]
["Shimoda",2]
["Shiroi",2]
["Shunan",2]
["Sukumo",2]
["Takanezawa",2]
["Takayama",2]
["Togane",2]
["Tomakomai",2]
["Tondabayashi",2]
["Tottori",2]
["Tsu",2]
["Tsuruoka",2]
["Ueda",2]
["Uwajima",2]
["Wako",2]
["Yachimata",2]
["Yamatotakada",2]
["Yame",2]
["Yanai",2]
["Aikawa",1]
["Aizuwakamatsu",1]
["Akashi",1]
["Asago",1]
["Asahi",1]
["Ayase",1]
["Bizen",1]
["Chikushino",1]
["Chino",1]
["Chita",1]
["Daisen",1]
["Daito",1]
["Fujinomiya",1]
["Fukaya",1]
["Fukuchiyama",1]
["Gamagori",1]
["Habikino",1]
["Hakui",1]
["Hakusan",1]
["Hayama",1]
["Hekinan",1]
["Higashihiroshima",1]
["Higashimatsuyama",1]
["Higashiomi",1]
["Himi",1]
["Hofu",1]
["Honjo",1]
["Iida",1]
["Iki",1]
["Imabari",1]
["Ina",1]
["Inazawa",1]
["Ishinomaki",1]
["Itami",1]
["Iwata",1]
["Izumi",1]
["Izunokuni",1]
["Kadoma",1]
["Kameoka",1]
["Kameyama",1]
["Kamogawa",1]
["Kasai",1]
["Kashiba",1]
["Kashima",1]
["Kashiwazaki",1]
["Kasumigaura",1]
["Katori",1]
["Kawachinagano",1]
["Kobayashi",1]
["Komaki",1]
["Kota",1]
["Kure",1]
["Kurobe",1]
["Kyotanabe",1]
["Matsubushi",1]
["Mibu",1]
["Minami",1]
["Minobu",1]
["Misawa",1]
["Miyakonojo",1]
["Mombetsu",1]
["Moriguchi",1]
["Moriyama",1]
["Munakata",1]
["Nakatsu",1]
["Nakatsugawa",1]
["Nantan",1]
["Naruto",1]
["Nasu",1]
["Niihama",1]
["Ninohe",1]
["Nishio",1]
["Nisshin",1]
["Noshiro",1]
["Obu",1]
["Ofunato",1]
["Okinawa",1]
["Omachi",1]
["Osaki",1]
["Oshu",1]
["Sakata",1]
["Sasebo",1]
["Satsumasendai",1]
["Seto",1]
["Shikokuchuo",1]
["Shimabara",1]
["Shimotsuke",1]
["Shingu",1]
["Shiso",1]
["Sosa",1]
["Tahara",1]
["Takahama",1]
["Takehara",1]
["Takeo",1]
["Tanabe",1]
["Tatebayashi",1]
["Tatsuno",1]
["Tenri",1]
["Tomioka",1]
["Tosu",1]
["Towada",1]
["Tsurugashima",1]
["Uenohara",1]
["Ushiku",1]
["Yamatokoriyama",1]
["Yanagawa",1]
["Yasuda",1]
["Yasugi",1]
["Yonezawa",1]
["Yurihonjo",1]

{"sheet":"_ユ曜日","index":19,"n_rows":135,"n_cols":3,"rows_kept":135,"cut":false,"hidden":true,"merged":[[0,0,0,25],[9,0,9,25],[13,0,13,25]]}
["_ユ曜日"]
["Last Run On","2019-07-22T11:25:02"]
["View Name","すべてのウェブサイトのデータ"]
["Total Results Found",120]
["Total Results Returned",120]
["Contains Sampled Data","No"]
[]
[]
[]
["Totals For All Results"]
[null,null,"Sessions"]
[null,null,15045]
[]
["Results Breakdown"]
["Day of Week","Hour","Sessions"]
[0,0,72]
[0,1,49]
[0,2,47]
[0,3,41]
[0,4,41]
[0,5,41]
[0,6,38]
[0,7,62]
[0,8,45]
[0,9,63]
[0,10,79]
[0,11,80]
[0,12,94]
[0,13,95]
[0,14,83]
[0,15,73]
[0,16,92]
[0,17,104]
[0,18,103]
[0,19,85]
[0,20,112]
[0,21,121]
[0,22,121]
[0,23,102]
[3,0,0]
[3,1,0]
[3,2,0]
[3,3,0]
[3,4,1]
[3,5,0]
[3,6,0]
[3,7,0]
[3,8,15]
[3,9,168]
[3,10,834]
[3,11,716]
[3,12,1172]
[3,13,493]
[3,14,316]
[3,15,299]
[3,16,231]
[3,17,240]
[3,18,294]
[3,19,356]
[3,20,356]
[3,21,311]
[3,22,331]
[3,23,284]
[4,0,252]
[4,1,192]
[4,2,125]
[4,3,98]
[4,4,86]
[4,5,83]
[4,6,127]
[4,7,164]
[4,8,158]
[4,9,103]
[4,10,158]
[4,11,95]
[4,12,123]
[4,13,90]
[4,14,86]
[4,15,92]
[4,16,90]
[4,17,105]
[4,18,87]
[4,19,110]
[4,20,148]
[4,21,155]
[4,22,146]
[4,23,94]
[5,0,75]
[5,1,57]
[5,2,53]
[5,3,34]
[5,4,28]
[5,5,54]
[5,6,60]
[5,7,66]
[5,8,60]
[5,9,59]
[5,10,58]
[5,11,77]
[5,12,79]
[5,13,88]
[5,14,74]
[5,15,84]
[5,16,79]
[5,17,125]
[5,18,96]
[5,19,114]
[5,20,98]
[5,21,115]
[5,22,92]
[5,23,118]
[6,0,110]
[6,1,69]
[6,2,62]
[6,3,41]
[6,4,47]
[6,5,43]
[6,6,45]
[6,7,63]
[6,8,77]
[6,9,88]
[6,10,89]
[6,11,92]
[6,12,80]
[6,13,110]
[6,14,82]
[6,15,109]
[6,16,104]
[6,17,118]
[6,18,97]
[6,19,75]
[6,20,102]
[6,21,85]
[6,22,92]
[6,23,95]

{"sheet":"_ユ性別","index":20,"n_rows":17,"n_cols":2,"rows_kept":17,"cut":false,"hidden":true,"merged":[[0,0,0,25],[9,0,9,25],[13,0,13,25]]}
["_ユ性別"]
["Last Run On","2019-07-22T11:25:02"]
["View Name","すべてのウェブサイトのデータ"]
["Total Results Found",2]
["Total Results Returned",2]
["Contains Sampled Data","No"]
[]
[]
[]
["Totals For All Results"]
[null,"Users"]
[null,4091]
[]
["Results Breakdown"]
["Gender","Users"]
["male",2832]
["female",1259]

{"sheet":"_ユ年齢","index":21,"n_rows":21,"n_cols":2,"rows_kept":21,"cut":false,"hidden":true,"merged":[[0,0,0,25],[9,0,9,25],[13,0,13,25]]}
["_ユ年齢"]
["Last Run On","2019-07-22T11:25:02"]
["View Name","すべてのウェブサイトのデータ"]
["Total Results Found",6]
["Total Results Returned",6]
["Contains Sampled Data","No"]
[]
[]
[]
["Totals For All Results"]
[null,"Users"]
[null,3916]
[]
["Results Breakdown"]
["Age","Users"]
["18-24",517]
["25-34",1238]
["35-44",904]
["45-54",903]
["55-64",250]
["65+",104]

{"sheet":"_ユインタレスト","index":22,"n_rows":128,"n_cols":2,"rows_kept":128,"cut":false,"hidden":true,"merged":[[0,0,0,25],[9,0,9,25],[13,0,13,25]]}
["_ユインタレスト"]
["Last Run On","2019-07-22T11:25:03"]
["View Name","すべてのウェブサイトのデータ"]
["Total Results Found",113]
["Total Results Returned",113]
["Contains Sampled Data","No"]
[]
[]
[]
["Totals For All Results"]
[null,"Users"]
[null,90823]
[]
["Results Breakdown"]
["Affinity Category (reach)","Users"]
["Media & Entertainment/Music Lovers",2920]
["Lifestyles & Hobbies/Green Living Enthusiasts",2402]
["News & Politics/Avid News Readers",2275]
["Media & Entertainment/Movie Lovers",2234]
["Media & Entertainment/TV Lovers",2213]
["Shoppers/Value Shoppers",2133]
["Media & Entertainment/Comics & Animation Fans",2057]
["Sports & Fitness/Sports Fans",2054]
["Shoppers/Luxury Shoppers",2025]
["Lifestyles & Hobbies/Business Professionals",1994]
["Sports & Fitness/Health & Fitness Buffs",1952]
["Lifestyles & Hobbies/Art & Theater Aficionados",1941]
["Technology/Mobile Enthusiasts",1903]
["Lifestyles & Hobbies/Shutterbugs",1813]
["Food & Dining/Foodies",1811]
["Media & Entertainment/Music Lovers/World Music Fans",1735]
["Lifestyles & Hobbies/Outdoor Enthusiasts",1713]
["Beauty & Wellness/Frequently Visits Salons",1702]
["Media & Entertainment/Music Lovers/Pop Music Fans",1700]
["Food & Dining/Fast Food Cravers",1678]
["News & Politics/Avid News Readers/Entertainment News Enthusiasts",1667]
["Lifestyles & Hobbies/Frequently Attends Live Events",1640]
["Technology/Technophiles",1632]
["Vehicles & Transportation/Auto Enthusiasts",1609]
["Travel/Travel Buffs",1507]
["Lifestyles & Hobbies/Nightlife Enthusiasts",1483]
["Home & Garden/Do-It-Yourselfers",1389]
["Lifestyles & Hobbies/Pet Lovers",1389]
["Media & Entertainment/Book Lovers",1375]
["Food & Dining/Cooking Enthusiasts/30 Minute Chefs",1324]
["News & Politics/Avid News Readers/Avid Political News Readers",1322]
["Food & Dining/Frequently Dines Out/Diners by Meal/Frequently Eats Lunch Out",1280]
["Travel/Business Travelers",1243]
["Beauty & Wellness/Beauty Mavens",1208]
["Food & Dining/Coffee Shop Regulars",1185]
["Media & Entertainment/Gamers",1184]
["Lifestyles & Hobbies/Fashionistas",1169]
["Shoppers/Shopaholics",1156]
["Food & Dining/Frequently Dines Out/Diners by Meal/Frequently Eats Dinner Out",1155]
["Shoppers/Shoppers by Store Type/Convenience Store Shoppers",1099]
["Food & Dining/Cooking Enthusiasts",1063]
["Technology/Social Media Enthusiasts",1031]
["Media & Entertainment/TV Lovers/TV Drama Fans",1019]
["Lifestyles & Hobbies/Family-Focused",1012]
["Sports & Fitness/Sports Fans/Baseball Fans",967]
["Banking & Finance/Avid Investors",920]
["Shoppers/Bargain Hunters",911]
["Media & Entertainment/Light TV Viewers",851]
["Shoppers/Shoppers by Store Type/Department Store Shoppers",783]
["Sports & Fitness/Sports Fans/Soccer Fans",779]
["Home & Garden/Home Decor Enthusiasts",747]
["Food & Dining/Cooking Enthusiasts/Aspiring Chefs",705]
["Media & Entertainment/Gamers/Hardcore Gamers",705]
["Media & Entertainment/TV Lovers/Game, Reality & Talk Show Fans",663]
["Media & Entertainment/Music Lovers/Rock Music Fans",657]
["Food & Dining/Frequently Dines Out/Diners by Meal/Frequently Eats Breakfast Out",599]
["News & Politics/Avid News Readers/Avid Business News Readers",593]
["Lifestyles & Hobbies/Thrill Seekers",570]
["Media & Entertainment/Gamers/Roleplaying Game Fans",500]
["Media & Entertainment/Gamers/Casual & Social Gamers",435]
["Sports & Fitness/Sports Fans/Fight & Wrestling Fans",378]
["Media & Entertainment/Gamers/Action Game Fans",355]
["Sports & Fitness/Sports Fans/Running Enthusiasts",299]
["Vehicles & Transportation/Auto Enthusiasts/Performance & Luxury Vehicle Enthusiasts",299]
["Vehicles & Transportation/Auto Enthusiasts/Motorcycle Enthusiasts",293]
["Media & Entertainment/Music Lovers/Rap & Hip Hop Fans",292]
["Travel/Travel Buffs/Beachbound Travelers",282]
["Travel/Travel Buffs/Family Vacationers",282]
["Media & Entertainment/Movie Lovers/Action & Adventure Movie Fans",274]
["Sports & Fitness/Sports Fans/Racquetball Enthusiasts",255]
["Sports & Fitness/Sports Fans/Rugby Enthusiasts",238]
["Media & Entertainment/Music Lovers/Electronic Dance Music Fans",230]
["Media & Entertainment/Gamers/Adventure & Strategy Game Fans",229]
["Sports & Fitness/Sports Fans/Golf Enthusiasts",217]
["Sports & Fitness/Sports Fans/Tennis Enthusiasts",217]
["Media & Entertainment/Gamers/Shooter Game Fans",215]
["Media & Entertainment/Movie Lovers/Sci-Fi & Fantasy Movie Fans",215]
["Sports & Fitness/Sports Fans/Basketball Fans",206]
["Travel/Travel Buffs/Luxury Travelers",205]
["Media & Entertainment/TV Lovers/Family Television Fans",200]
["Media & Entertainment/TV Lovers/TV Comedy Fans",175]
["Media & Entertainment/Movie Lovers/Family Movie Fans",158]
["Vehicles & Transportation/Auto Enthusiasts/Truck & SUV Enthusiasts",151]
["Media & Entertainment/Movie Lovers/South Asian Film Fans",145]
["Media & Entertainment/Music Lovers/Indie & Alternative Rock Fans",140]
["Sports & Fitness/Sports Fans/Motor Sports Enthusiasts",135]
["News & Politics/Avid News Readers/Avid Local News Readers",134]
["Lifestyles & Hobbies/Pet Lovers/Dog Lovers",133]
["Lifestyles & Hobbies/Pet Lovers/Cat Lovers",120]
["Media & Entertainment/Movie Lovers/Romance & Drama Movie Fans",116]
["Media & Entertainment/Music Lovers/Classical Music Enthusiasts",113]
["Media & Entertainment/Music Lovers/Metalheads",112]
["Sports & Fitness/Sports Fans/Cycling Enthusiasts",102]
["Sports & Fitness/Sports Fans/Winter Sports Enthusiasts",95]
["Sports & Fitness/Sports Fans/Cricket Enthusiasts",94]
["Travel/Travel Buffs/Snowbound Travelers",93]
["Media & Entertainment/Music Lovers/Folk & Traditional Music Enthusiasts",82]
["Media & Entertainment/Movie Lovers/Horror Movie Fans",76]
["Media & Entertainment/Music Lovers/Jazz Enthusiasts",67]
["News & Politics/Avid News Readers/Women's Media Fans",65]
["Media & Entertainment/Movie Lovers/Comedy Movie Fans",62]
["Sports & Fitness/Sports Fans/Water Sports Enthusiasts",61]
["Media & Entertainment/Music Lovers/Spanish-Language Music Fans",56]
["Media & Entertainment/TV Lovers/Sci-Fi & Fantasy TV Fans",56]
["Media & Entertainment/Gamers/Driving & Racing Game Fans",52]
["Media & Entertainment/Gamers/Sports Game Fans",52]
["Sports & Fitness/Sports Fans/Boating & Sailing Enthusiasts",45]
["Sports & Fitness/Sports Fans/Swimming Enthusiasts",42]
["Media & Entertainment/Music Lovers/Country Music Fans",34]
["News & Politics/Avid News Readers/Avid World News Readers",31]
["Media & Entertainment/TV Lovers/Documentary & Nonfiction TV Fans",27]
["Sports & Fitness/Sports Fans/American Football Fans",27]
["Sports & Fitness/Sports Fans/Hockey Fans",10]

{"sheet":"_集チャンネル","index":23,"n_rows":20,"n_cols":2,"rows_kept":20,"cut":false,"hidden":true,"merged":[[0,0,0,25],[9,0,9,25],[13,0,13,25]]}
["_集チャンネル"]
["Last Run On","2019-07-22T11:25:00"]
["View Name","すべてのウェブサイトのデータ"]
["Total Results Found",5]
["Total Results Returned",5]
["Contains Sampled Data","No"]
[]
[]
[]
["Totals For All Results"]
[null,"Users"]
[null,12688]
[]
["Results Breakdown"]
["Default Channel Grouping","Users"]
["Paid Search",5827]
["Referral",2919]
["Social",2283]
["Direct",1496]
["Organic Search",163]

{"sheet":"_集参照サイト","index":24,"n_rows":45,"n_cols":2,"rows_kept":45,"cut":false,"hidden":true,"merged":[[0,0,0,25],[9,0,9,25],[13,0,13,25]]}
["_集参照サイト"]
["Last Run On","2019-07-22T11:25:00"]
["View Name","すべてのウェブサイトのデータ"]
["Total Results Found",37]
["Total Results Returned",37]
["Contains Sampled Data","No"]
[]
[]
[]
["Totals For All Results"]
[null,"Users"]
[null,5312]
[]
["Results Breakdown"]
["Source","Users"]
["t.co",2167]
["asahi.com",104]
["m.facebook.com",60]
["av.watch.impress.co.jp",49]
["twitter.com",26]
["itest.5ch.net",24]
["youtube.com",22]
["www-asahi-com.cdn.ampproject.org",18]
["facebook.com",7]
["n2ch.net",4]
["cse.google.com",3]
["digital.asahi.com",3]
["lancers.jp",3]
["nozomi.2ch.sc",3]
["download.co.jp",2]
["l.facebook.com",2]
["l.moapi.net",2]
["m.youtube.com",2]
["111.16.100.102",1]
["222.32.0.142:10080",1]
["adwords.corp.google.com",1]
["blog.livedoor.jp",1]
["cse.google.com.ph",1]
["eto.lightning.force.com",1]
["hayabusa3.2ch.sc",1]
["infith.com",1]
["jp.mg5.mail.yahoo.co.jp",1]
["kyodemo.net",1]
["mixi.jp",1]
["t.umblr.com",1]

{"sheet":"_集ペイド","index":25,"n_rows":46,"n_cols":2,"rows_kept":46,"cut":false,"hidden":true,"merged":[[0,0,0,25],[9,0,9,25],[13,0,13,25]]}
["_集ペイド"]
["Last Run On","2019-07-22T11:25:01"]
["View Name","すべてのウェブサイトのデータ"]
["Total Results Found",5]
["Total Results Returned",5]
["Contains Sampled Data","No"]
[]
[]
[]
["Totals For All Results"]
[null,"Users"]
[null,5891]
[]
["Results Breakdown"]
["Date","Users"]
["2019-07-01",5446]
["2019-07-02",3123]
["2019-07-03",3212]
["2019-07-04",3301]
["2019-07-05",3390]
["2019-07-06",3479]
["2019-07-07",3568]
["2019-07-08",3657]
["2019-07-09",3746]
["2019-07-10",3835]
["2019-07-11",3924]
["2019-07-12",4013]
["2019-07-13",4102]
["2019-07-14",4191]
["2019-07-15",4280]
["2019-07-16",4369]
["2019-07-17",4458]
["2019-07-18",4547]
["2019-07-19",4636]
["2019-07-20",4725]
["2019-07-21",4814]
["2019-07-22",4903]
["2019-07-23",4992]
["2019-07-24",5081]
["2019-07-25",5170]
["2019-07-26",5259]
["2019-07-27",5348]
["2019-07-28",5437]
["2019-07-29",5526]
["2019-07-30",5615]
["2019-07-31",5615]

{"sheet":"Report Configuration","index":26,"n_rows":18,"n_cols":15,"rows_kept":18,"cut":false,"hidden":true,"merged":[[0,1,0,2],[17,0,999,0],[17,1,17,18],[18,1,999,18]]}
["Configuration Options"]
["Report Name","_集キーワード","_集チャンネル","_集参照サイト","_集ペイド","_ユ推移","_ユ","_ユ国","_ユ市区","_ユデバイス","_ユ性別","_ユ年齢","_ユ曜日","_ユインタレスト","_行ページ"]
["View ID",111111111,{"$f":"B3","v":111111111},111111111,111111111,111111111,111111111,111111111,111111111,111111111,111111111,111111111,111111111,{"$f":"L3","v":111111111},{"$f":"N3","v":111111111}]
["Start Date","2019-07-01","2019-07-01","2019-07-01","2019-07-01","2019-07-01","2019-07-01","2019-07-01","2019-07-01","2019-07-01","2019-07-01","2019-07-01","2019-07-01","2019-07-01","2019-07-01"]
["End Date","2019-07-31","2019-07-31","2019-07-31","2019-07-31","2019-07-31","2019-07-31","2019-07-31","2019-07-31","2019-07-31","2019-07-31","2019-07-31","2019-07-31","2019-07-31","2019-07-31"]
["Metrics","ga:organicSearches","ga:users","ga:users","ga:users","ga:users,ga:sessions,ga:pageviews","ga:users,ga:sessions,ga:pageviews,ga:bounceRate,ga:avgSessionDuration,ga:sessionsPerUser,ga:pageviewsPerSession,ga:goal1Completions,ga:goal2Completions","ga:users","ga:users","ga:users","ga:users","ga:users","ga:sessions","ga:users","ga:pageviews,ga:sessions,ga:avgTimeOnPage,ga:entrances,ga:bounceRate,ga:exitRate"]
["Dimensions","ga:keyword,ga:source","ga:channelGrouping","ga:source","ga:date","ga:date",null,"ga:country","ga:city","ga:deviceCategory","ga:userGender","ga:userAgeBracket","ga:dayOfWeek,ga:hour","ga:interestAffinityCategory","ga:pagePath"]
["Order","-ga:organicSearches","-ga:users","-ga:users","ga:date",null,null,"-ga:users","-ga:users","-ga:users","-ga:users","ga:userAgeBracket",null,"-ga:users","-ga:pageviews"]
["Filters",null,null,null,null,null,null,null,"ga:country==Japan"]
["Segments",null,null,"gaid::-8","gaid::-4"]
["Limit",1000,1000,1000,1000,1000,5000]
["Spreadsheet URL"]
["Skip Report"]
["Report Type"]
["Sampling Level"]
["Use Resource Quotas"]
["Exclude Empty Rows"]
[null,"https://developers.google.com/analytics/solutions/google-analytics-spreadsheet-add-on"]